mesos-reviews mailing list archives

Site index · List index
Message view « Date » · « Thread »
Top « Date » · « Thread »
From Mesos Reviewbot Windows <revi...@mesos.apache.org>
Subject Re: Review Request 67301: Fixed a typo in libprocess documentation.
Date Fri, 25 May 2018 00:07:17 GMT

-----------------------------------------------------------
This is an automatically generated e-mail. To reply, visit:
https://reviews.apache.org/r/67301/#review203830
-----------------------------------------------------------



FAIL: Some of the unit tests failed. Please check the relevant logs.

Reviews applied: `['67301']`

Failed command: `Start-MesosCITesting`

All the build artifacts available at: http://dcos-win.westus.cloudapp.azure.com/mesos-build/review/67301

Relevant logs:

- [mesos-tests-stdout.log](http://dcos-win.westus.cloudapp.azure.com/mesos-build/review/67301/logs/mesos-tests-stdout.log):

```
[       OK ] Endpoint/SlaveEndpointTest.NoAuthorizer/2 (110 ms)
[----------] 9 tests from Endpoint/SlaveEndpointTest (1018 ms total)

[----------] 2 tests from ContainerizerType/DefaultContainerDNSFlagTest
[ RUN      ] ContainerizerType/DefaultContainerDNSFlagTest.ValidateFlag/0
[       OK ] ContainerizerType/DefaultContainerDNSFlagTest.ValidateFlag/0 (35 ms)
[ RUN      ] ContainerizerType/DefaultContainerDNSFlagTest.ValidateFlag/1
[       OK ] ContainerizerType/DefaultContainerDNSFlagTest.ValidateFlag/1 (36 ms)
[----------] 2 tests from ContainerizerType/DefaultContainerDNSFlagTest (73 ms total)

[----------] 1 test from IsolationFlag/CpuIsolatorTest
[ RUN      ] IsolationFlag/CpuIsolatorTest.ROOT_UserCpuUsage/0
[       OK ] IsolationFlag/CpuIsolatorTest.ROOT_UserCpuUsage/0 (732 ms)
[----------] 1 test from IsolationFlag/CpuIsolatorTest (758 ms total)

[----------] 1 test from IsolationFlag/MemoryIsolatorTest
[ RUN      ] IsolationFlag/MemoryIsolatorTest.ROOT_MemUsage/0
[       OK ] IsolationFlag/MemoryIsolatorTest.ROOT_MemUsage/0 (724 ms)
[----------] 1 test from IsolationFlag/MemoryIsolatorTest (750 ms total)

[----------] Global test environment tear-down
[==========] 980 tests from 95 test cases ran. (465868 ms total)
[  PASSED  ] 979 tests.
[  FAILED  ] 1 test, listed below:
[  FAILED  ] DockerContainerizerHealthCheckTest.ROOT_DOCKER_DockerHealthStatusChange

 1 FAILED TEST
  YOU HAVE 220 DISABLED TESTS

```

- [mesos-tests-stderr.log](http://dcos-win.westus.cloudapp.azure.com/mesos-build/review/67301/logs/mesos-tests-stderr.log):

```
I0525 00:07:00.182763 19056 hierarchical.cpp:405] Deactivated framework c7d89a87-c885-418c-a13d-aa0290e789e7-0000
I0525 00:07:00.182763 20412 slave.cpp:3935] Shutting down framework c7d89a87-c885-418c-a13d-aa0290e789e7-0000
I0525 00:07:00.182763 20412 slave.cpp:6656] Shutting down executor 'f58ace8f-75c7-4049-bccd-87c4e5bbdd54'
of framework c7d89a87-c885-418c-a13d-aa0290e789e7-0000 at executor(1)@192.10.1.5:53699
I0525 00:07:00.184765 20412 slave.cpp:929] Agent terminating
W0525 00:07:00.184765 20412 slave.cpp:3931] Ignoring shutdown framework c7d89a87-c885-418c-a13d-aa0290e789eI0525
00:07:00.016777 22072 exec.cpp:162] Version: 1.7.0
I0525 00:07:00.042774 21684 exec.cpp:236] Executor registered on agent c7d89a87-c885-418c-a13d-aa0290e789e7-S0
I0525 00:07:00.046763 15720 executor.cpp:178] Received SUBSCRIBED event
I0525 00:07:00.051787 15720 executor.cpp:182] Subscribed executor on windows-01.enofukwu14ruplxn0gs3yzmsgf.xx.internal.cloudapp.net
I0525 00:07:00.051787 15720 executor.cpp:178] Received LAUNCH event
I0525 00:07:00.056757 15720 executor.cpp:665] Starting task f58ace8f-75c7-4049-bccd-87c4e5bbdd54
I0525 00:07:00.135763 15720 executor.cpp:485] Running 'D:\DCOS\mesos\src\mesos-containerizer.exe
launch <POSSIBLY-SENSITIVE-DATA>'
I0525 00:07:00.152765 15720 executor.cpp:678] Forked command at 24540
I0525 00:07:00.184765 24176 exec.cpp:445] Executor asked to shutdown
I0525 00:07:00.185768 18720 executor.cpp:178] Received SHUTDOWN event
I0525 00:07:00.185768 18720 executor.cpp:781] Shutting down
I0525 00:07:00.185768 18720 executor.cpp:894] Sending SIGTERM to process tree at pid 247-0000
because it is terminating
I0525 00:07:00.185768 23896 master.cpp:10942] Removing task f58ace8f-75c7-4049-bccd-87c4e5bbdd54
with resources cpus(allocated: *):4; mem(allocated: *):2048; disk(allocated: *):1024; ports(allocated:
*):[31000-32000] of framework c7d89a87-c885-418c-a13d-aa0290e789e7-0000 on agent c7d89a87-c885-418c-a13d-aa0290e789e7-S0
at slave(447)@192.10.1.5:53678 (windows-01.enofukwu14ruplxn0gs3yzmsgf.xx.internal.cloudapp.net)
I0525 00:07:00.188784 19056 master.cpp:1293] Agent c7d89a87-c885-418c-a13d-aa0290e789e7-S0
at slave(447)@192.10.1.5:53678 (windows-01.enofukwu14ruplxn0gs3yzmsgf.xx.internal.cloudapp.net)
disconnected
I0525 00:07:00.188784 19056 master.cpp:3303] Disconnecting agent c7d89a87-c885-418c-a13d-aa0290e789e7-S0
at slave(447)@192.10.1.5:53678 (windows-01.enofukwu14ruplxn0gs3yzmsgf.xx.internal.cloudapp.net)
I0525 00:07:00.188784 19056 master.cpp:3322] Deactivating agent c7d89a87-c885-418c-a13d-aa0290e789e7-S0
at slave(447)@192.10.1.5:53678 (windows-01.enofukwu14ruplxn0gs3yzmsgf.xx.internal.cloudapp.net)
I0525 00:07:00.188784 16956 hierarchical.cpp:344] Removed framework c7d89a87-c885-418c-a13d-aa0290e789e7-0000
I0525 00:07:00.189766 16956 hierarchical.cpp:766] Agent c7d89a87-c885-418c-a13d-aa0290e789e7-S0
deactivated
I0525 00:07:00.190762 22580 containerizer.cpp:2401] Destroying container 27ff5b24-9751-4be7-a5a8-46cd829fe807
in RUNNING state
I0525 00:07:00.190762 22580 containerizer.cpp:3015] Transitioning the state of container 27ff5b24-9751-4be7-a5a8-46cd829fe807
from RUNNING to DESTROYING
I0525 00:07:00.191762 22580 launcher.cpp:156] Asked to destroy container 27ff5b24-9751-4be7-a5a8-46cd829fe807
I0525 00:07:00.216764 13284 containerizer.cpp:2854] Container 27ff5b24-9751-4be7-a5a8-46cd829fe807
has exited
I0525 00:07:00.248769 22920 master.cpp:1135] Master terminating
I0525 00:07:00.251780 17948 hierarchical.cpp:609] Removed agent c7d89a87-c885-418c-a13d-aa0290e789e7-S0
I0525 00:07:00.890712  6688 process.cpp:940] Stopped the socket accept loop
```

- Mesos Reviewbot Windows


On May 24, 2018, 3:51 p.m., Meng Zhu wrote:
> 
> -----------------------------------------------------------
> This is an automatically generated e-mail. To reply, visit:
> https://reviews.apache.org/r/67301/
> -----------------------------------------------------------
> 
> (Updated May 24, 2018, 3:51 p.m.)
> 
> 
> Review request for mesos and Benjamin Mahler.
> 
> 
> Repository: mesos
> 
> 
> Description
> -------
> 
> Fixed a typo in libprocess documentation.
> 
> 
> Diffs
> -----
> 
>   3rdparty/libprocess/README.md d8b28fae4050a71b1a62fda3e13f2f27e176b121 
> 
> 
> Diff: https://reviews.apache.org/r/67301/diff/1/
> 
> 
> Testing
> -------
> 
> Not needed.
> 
> 
> Thanks,
> 
> Meng Zhu
> 
>


Mime
  • Unnamed multipart/alternative (inline, None, 0 bytes)
View raw message