mesos-reviews mailing list archives

Site index · List index
Message view « Date » · « Thread »
Top « Date » · « Thread »
From Mesos Reviewbot Windows <revi...@mesos.apache.org>
Subject Re: Review Request 67288: White list fds that child processes can inherit in mesos containerizer.
Date Thu, 24 May 2018 18:44:58 GMT

-----------------------------------------------------------
This is an automatically generated e-mail. To reply, visit:
https://reviews.apache.org/r/67288/#review203798
-----------------------------------------------------------



FAIL: Some of the unit tests failed. Please check the relevant logs.

Reviews applied: `['67286', '67287', '67288']`

Failed command: `Start-MesosCITesting`

All the build artifacts available at: http://dcos-win.westus.cloudapp.azure.com/mesos-build/review/67288

Relevant logs:

- [mesos-tests-stdout.log](http://dcos-win.westus.cloudapp.azure.com/mesos-build/review/67288/logs/mesos-tests-stdout.log):

```
[       OK ] Endpoint/SlaveEndpointTest.NoAuthorizer/2 (105 ms)
[----------] 9 tests from Endpoint/SlaveEndpointTest (987 ms total)

[----------] 2 tests from ContainerizerType/DefaultContainerDNSFlagTest
[ RUN      ] ContainerizerType/DefaultContainerDNSFlagTest.ValidateFlag/0
[       OK ] ContainerizerType/DefaultContainerDNSFlagTest.ValidateFlag/0 (32 ms)
[ RUN      ] ContainerizerType/DefaultContainerDNSFlagTest.ValidateFlag/1
[       OK ] ContainerizerType/DefaultContainerDNSFlagTest.ValidateFlag/1 (37 ms)
[----------] 2 tests from ContainerizerType/DefaultContainerDNSFlagTest (70 ms total)

[----------] 1 test from IsolationFlag/CpuIsolatorTest
[ RUN      ] IsolationFlag/CpuIsolatorTest.ROOT_UserCpuUsage/0
[       OK ] IsolationFlag/CpuIsolatorTest.ROOT_UserCpuUsage/0 (711 ms)
[----------] 1 test from IsolationFlag/CpuIsolatorTest (736 ms total)

[----------] 1 test from IsolationFlag/MemoryIsolatorTest
[ RUN      ] IsolationFlag/MemoryIsolatorTest.ROOT_MemUsage/0
[       OK ] IsolationFlag/MemoryIsolatorTest.ROOT_MemUsage/0 (735 ms)
[----------] 1 test from IsolationFlag/MemoryIsolatorTest (761 ms total)

[----------] Global test environment tear-down
[==========] 981 tests from 95 test cases ran. (443432 ms total)
[  PASSED  ] 980 tests.
[  FAILED  ] 1 test, listed below:
[  FAILED  ] DockerContainerizerHealthCheckTest.ROOT_DOCKER_DockerHealthStatusChange

 1 FAILED TEST
  YOU HAVE 220 DISABLED TESTS

```

- [mesos-tests-stderr.log](http://dcos-win.westus.cloudapp.azure.com/mesos-build/review/67288/logs/mesos-tests-stderr.log):

```
I0524 18:44:41.671682  9016 master.cpp:10843] Updating the state of task 3c3864d6-6308-42e5-9a55-48a0a7104eea
of framework 5ac27953-d736-4ee8-aa5a-0f94cd927f5d-0000 (latest state: TASK_KILLED, status
update state: TASK_KILLED)
I0524 18:44:41.672682 15844 slave.cpp:3935] Shutting down framework 5ac27953-d736-4ee8-aa5a-0f94cd927f5d-0000
I0524 18:44:41.672682 158I0524 18:44:41.509665 21876 exec.cpp:162] Version: 1.7.0
I0524 18:44:41.534665 16468 exec.cpp:236] Executor registered on agent 5ac27953-d736-4ee8-aa5a-0f94cd927f5d-S0
I0524 18:44:41.538671 11924 executor.cpp:178] Received SUBSCRIBED event
I0524 18:44:41.542667 11924 executor.cpp:182] Subscribed executor on windows-02.enofukwu14ruplxn0gs3yzmsgf.xx.internal.cloudapp.net
I0524 18:44:41.543673 11924 executor.cpp:178] Received LAUNCH event
I0524 18:44:41.548682 11924 executor.cpp:665] Starting task 3c3864d6-6308-42e5-9a55-48a0a7104eea
I0524 18:44:41.626684 11924 executor.cpp:485] Running 'D:\DCOS\mesos\src\mesos-containerizer.exe
launch <POSSIBLY-SENSITIVE-DATA>'
I0524 18:44:41.643685 11924 executor.cpp:678] Forked command at 21096
I0524 18:44:41.675681  8068 exec.cpp:445] Executor asked to shutdown
I0524 18:44:41.675681 19868 executor.cpp:178] Received SHUTDOWN event
I0524 18:44:41.675681 19868 executor.cpp:781] Shutting down
I0524 18:44:41.675681 19868 executor.cpp:894] Sending SIGTERM to process tree at pid 2144
slave.cpp:6656] Shutting down executor '3c3864d6-6308-42e5-9a55-48a0a7104eea' of framework
5ac27953-d736-4ee8-aa5a-0f94cd927f5d-0000 at executor(1)@192.10.1.6:57255
I0524 18:44:41.674679  9016 master.cpp:10942] Removing task 3c3864d6-6308-42e5-9a55-48a0a7104eea
with resources cpus(allocated: *):4; mem(allocated: *):2048; disk(allocated: *):1024; ports(allocated:
*):[31000-32000] of framework 5ac27953-d736-4ee8-aa5a-0f94cd927f5d-0000 on agent 5ac27953-d736-4ee8-aa5a-0f94cd927f5d-S0
at slave(448)@192.10.1.6:57234 (windows-02.enofukwu14ruplxn0gs3yzmsgf.xx.internal.cloudapp.net)
I0524 18:44:41.674679 15844 slave.cpp:929] Agent terminating
W0524 18:44:41.675681 15844 slave.cpp:3931] Ignoring shutdown framework 5ac27953-d736-4ee8-aa5a-0f94cd927f5d-0000
because it is terminating
I0524 18:44:41.677678 15756 master.cpp:1293] Agent 5ac27953-d736-4ee8-aa5a-0f94cd927f5d-S0
at slave(448)@192.10.1.6:57234 (windows-02.enofukwu14ruplxn0gs3yzmsgf.xx.internal.cloudapp.net)
disconnected
I0524 18:44:41.677678 15756 master.cpp:3303] Disconnecting agent 5ac27953-d736-4ee8-aa5a-0f94cd927f5d-S0
at slave(448)@192.10.1.6:57234 (windows-02.enofukwu14ruplxn0gs3yzmsgf.xx.internal.cloudapp.net)
I0524 18:44:41.678678 11896 hierarchical.cpp:344] Removed framework 5ac27953-d736-4ee8-aa5a-0f94cd927f5d-0000
I0524 18:44:41.678678 15756 master.cpp:3322] Deactivating agent 5ac27953-d736-4ee8-aa5a-0f94cd927f5d-S0
at slave(448)@192.10.1.6:57234 (windows-02.enofukwu14ruplxn0gs3yzmsgf.xx.internal.cloudapp.net)
I0524 18:44:41.678678 17032 hierarchical.cpp:766] Agent 5ac27953-d736-4ee8-aa5a-0f94cd927f5d-S0
deactivated
I0524 18:44:41.679720 21508 containerizer.cpp:2406] Destroying container 02e0acaf-3a4a-4910-8de1-47fc20c97ad9
in RUNNING state
I0524 18:44:41.679720 21508 containerizer.cpp:3020] Transitioning the state of container 02e0acaf-3a4a-4910-8de1-47fc20c97ad9
from RUNNING to DESTROYING
I0524 18:44:41.680809 21508 launcher.cpp:158] Asked to destroy container 02e0acaf-3a4a-4910-8de1-47fc20c97ad9
I0524 18:44:41.745687 15640 containerizer.cpp:2859] Container 02e0acaf-3a4a-4910-8de1-47fc20c97ad9
has exited
I0524 18:44:41.776279   256 master.cpp:1135] Master terminating
I0524 18:44:41.777663 19108 hierarchical.cpp:609] Removed agent 5ac27953-d736-4ee8-aa5a-0f94cd927f5d-S0
I0524 18:44:42.197670 21816 process.cpp:940] Stopped the socket accept loop
```

- Mesos Reviewbot Windows


On May 24, 2018, 6:43 p.m., Radhika Jandhyala wrote:
> 
> -----------------------------------------------------------
> This is an automatically generated e-mail. To reply, visit:
> https://reviews.apache.org/r/67288/
> -----------------------------------------------------------
> 
> (Updated May 24, 2018, 6:43 p.m.)
> 
> 
> Review request for mesos, Akash Gupta, Andrew Schwartzmeyer, Eric Mumau, Jie Yu, Li Li,
and Radhika Jandhyala.
> 
> 
> Bugs: MESOS-8926
>     https://issues.apache.org/jira/browse/MESOS-8926
> 
> 
> Repository: mesos
> 
> 
> Description
> -------
> 
> Mesos containerizer.: White list fds that child processes can inherit
> 
> 
> Diffs
> -----
> 
>   src/slave/containerizer/mesos/containerizer.cpp eac1d16f2388385fec04ff8f013ce0ebf4e97f0f

>   src/slave/containerizer/mesos/launcher.hpp f69d934d2e1a129e10df8c7f5c78723e832adc7d

>   src/slave/containerizer/mesos/launcher.cpp 2fe47d368cb82a46328e1f636baa836272db244c

>   src/slave/containerizer/mesos/linux_launcher.hpp 0ea9b875ae46cadea483bc8dd8bf4907fd324dc9

>   src/slave/containerizer/mesos/linux_launcher.cpp 80e444501e429c1e1ae354abcd51f86430316ada

> 
> 
> Diff: https://reviews.apache.org/r/67288/diff/1/
> 
> 
> Testing
> -------
> 
> 
> Thanks,
> 
> Radhika Jandhyala
> 
>


Mime
  • Unnamed multipart/alternative (inline, None, 0 bytes)
View raw message