mesos-reviews mailing list archives

Site index · List index
Message view « Date » · « Thread »
Top « Date » · « Thread »
From Mesos Reviewbot Windows <revi...@mesos.apache.org>
Subject Re: Review Request 67291: Adjusted the tests that use nobody.
Date Thu, 24 May 2018 17:58:45 GMT

-----------------------------------------------------------
This is an automatically generated e-mail. To reply, visit:
https://reviews.apache.org/r/67291/#review203794
-----------------------------------------------------------



FAIL: Some of the unit tests failed. Please check the relevant logs.

Reviews applied: `['67289', '67290', '67291']`

Failed command: `Start-MesosCITesting`

All the build artifacts available at: http://dcos-win.westus.cloudapp.azure.com/mesos-build/review/67291

Relevant logs:

- [mesos-tests-stdout.log](http://dcos-win.westus.cloudapp.azure.com/mesos-build/review/67291/logs/mesos-tests-stdout.log):

```
[       OK ] Endpoint/SlaveEndpointTest.NoAuthorizer/2 (107 ms)
[----------] 9 tests from Endpoint/SlaveEndpointTest (1016 ms total)

[----------] 2 tests from ContainerizerType/DefaultContainerDNSFlagTest
[ RUN      ] ContainerizerType/DefaultContainerDNSFlagTest.ValidateFlag/0
[       OK ] ContainerizerType/DefaultContainerDNSFlagTest.ValidateFlag/0 (34 ms)
[ RUN      ] ContainerizerType/DefaultContainerDNSFlagTest.ValidateFlag/1
[       OK ] ContainerizerType/DefaultContainerDNSFlagTest.ValidateFlag/1 (38 ms)
[----------] 2 tests from ContainerizerType/DefaultContainerDNSFlagTest (73 ms total)

[----------] 1 test from IsolationFlag/CpuIsolatorTest
[ RUN      ] IsolationFlag/CpuIsolatorTest.ROOT_UserCpuUsage/0
[       OK ] IsolationFlag/CpuIsolatorTest.ROOT_UserCpuUsage/0 (740 ms)
[----------] 1 test from IsolationFlag/CpuIsolatorTest (765 ms total)

[----------] 1 test from IsolationFlag/MemoryIsolatorTest
[ RUN      ] IsolationFlag/MemoryIsolatorTest.ROOT_MemUsage/0
[       OK ] IsolationFlag/MemoryIsolatorTest.ROOT_MemUsage/0 (733 ms)
[----------] 1 test from IsolationFlag/MemoryIsolatorTest (757 ms total)

[----------] Global test environment tear-down
[==========] 980 tests from 95 test cases ran. (452607 ms total)
[  PASSED  ] 979 tests.
[  FAILED  ] 1 test, listed below:
[  FAILED  ] DockerContainerizerHealthCheckTest.ROOT_DOCKER_DockerHealthStatusChange

 1 FAILED TEST
  YOU HAVE 220 DISABLED TESTS

```

- [mesos-tests-stderr.log](http://dcos-win.westus.cloudapp.azure.com/mesos-build/review/67291/logs/mesos-tests-stderr.log):

```
I0524 17:58:28.605190 12804 master.cpp:10843] Updating the state of task 13880c12-575d-42f2-8bfc-360e9549a694
of framework 1cd8243a-73d8-454a-8360-9c407e93a3a3-0000 (latest state: TASK_KILLED, status
update state: TASK_KILLED)
I0524 17:58:28.605190  9228 slave.cpp:3935] Shutting down framework 1cd8243a-73d8-454a-8360-9c407e93a3a3-0000
I0524 17I0524 17:58:28.442185 21024 exec.cpp:162] Version: 1.7.0
I0524 17:58:28.467173 13408 exec.cpp:236] Executor registered on agent 1cd8243a-73d8-454a-8360-9c407e93a3a3-S0
I0524 17:58:28.471176 16896 executor.cpp:178] Received SUBSCRIBED event
I0524 17:58:28.475186 16896 executor.cpp:182] Subscribed executor on windows-02.enofukwu14ruplxn0gs3yzmsgf.xx.internal.cloudapp.net
I0524 17:58:28.475186 16896 executor.cpp:178] Received LAUNCH event
I0524 17:58:28.480186 16896 executor.cpp:665] Starting task 13880c12-575d-42f2-8bfc-360e9549a694
I0524 17:58:28.559188 16896 executor.cpp:485] Running 'D:\DCOS\mesos\src\mesos-containerizer.exe
launch <POSSIBLY-SENSITIVE-DATA>'
I0524 17:58:28.577188 16896 executor.cpp:678] Forked command at 16180
I0524 17:58:28.608178 21860 exec.cpp:445] Executor asked to shutdown
I0524 17:58:28.608178 18556 executor.cpp:178] Received SHUTDOWN event
I0524 17:58:28.608178 18556 executor.cpp:781] Shutting down
I0524 17:58:28.609171 18556 executor.cpp:894] Sending SIGTERM to process tree at pid 16:58:28.606176
 9228 slave.cpp:6656] Shutting down executor '13880c12-575d-42f2-8bfc-360e9549a694' of framework
1cd8243a-73d8-454a-8360-9c407e93a3a3-0000 at executor(1)@192.10.1.6:54636
I0524 17:58:28.608178  9228 slave.cpp:929] Agent terminating
W0524 17:58:28.608178  9228 slave.cpp:3931] Ignoring shutdown framework 1cd8243a-73d8-454a-8360-9c407e93a3a3-0000
because it is terminating
I0524 17:58:28.608178 12804 master.cpp:10942] Removing task 13880c12-575d-42f2-8bfc-360e9549a694
with resources cpus(allocated: *):4; mem(allocated: *):2048; disk(allocated: *):1024; ports(allocated:
*):[31000-32000] of framework 1cd8243a-73d8-454a-8360-9c407e93a3a3-0000 on agent 1cd8243a-73d8-454a-8360-9c407e93a3a3-S0
at slave(447)@192.10.1.6:54615 (windows-02.enofukwu14ruplxn0gs3yzmsgf.xx.internal.cloudapp.net)
I0524 17:58:28.611186 21268 master.cpp:1293] Agent 1cd8243a-73d8-454a-8360-9c407e93a3a3-S0
at slave(447)@192.10.1.6:54615 (windows-02.enofukwu14ruplxn0gs3yzmsgf.xx.internal.cloudapp.net)
disconnected
I0524 17:58:28.611186 21268 master.cpp:3303] Disconnecting agent 1cd8243a-73d8-454a-8360-9c407e93a3a3-S0
at slave(447)@192.10.1.6:54615 (windows-02.enofukwu14ruplxn0gs3yzmsgf.xx.internal.cloudapp.net)
I0524 17:58:28.611186 21268 master.cpp:3322] Deactivating agent 1cd8243a-73d8-454a-8360-9c407e93a3a3-S0
at slave(447)@192.10.1.6:54615 (windows-02.enofukwu14ruplxn0gs3yzmsgf.xx.internal.cloudapp.net)
I0524 17:58:28.612190 21756 hierarchical.cpp:344] Removed framework 1cd8243a-73d8-454a-8360-9c407e93a3a3-0000
I0524 17:58:28.612190 21756 hierarchical.cpp:766] Agent 1cd8243a-73d8-454a-8360-9c407e93a3a3-S0
deactivated
I0524 17:58:28.613216 16452 containerizer.cpp:2401] Destroying container b721f142-ec76-49e1-8b13-c65df4f60f35
in RUNNING state
I0524 17:58:28.613216 16452 containerizer.cpp:3015] Transitioning the state of container b721f142-ec76-49e1-8b13-c65df4f60f35
from RUNNING to DESTROYING
I0524 17:58:28.613216 16452 launcher.cpp:156] Asked to destroy container b721f142-ec76-49e1-8b13-c65df4f60f35
I0524 17:58:28.674186 12804 containerizer.cpp:2854] Container b721f142-ec76-49e1-8b13-c65df4f60f35
has exited
I0524 17:58:28.704186 22460 master.cpp:1135] Master terminating
I0524 17:58:28.706188  9228 hierarchical.cpp:609] Removed agent 1cd8243a-73d8-454a-8360-9c407e93a3a3-S0
I0524 17:58:29.201195 21440 process.cpp:940] Stopped the socket accept loop
```

- Mesos Reviewbot Windows


On May 24, 2018, 10:49 a.m., Jie Yu wrote:
> 
> -----------------------------------------------------------
> This is an automatically generated e-mail. To reply, visit:
> https://reviews.apache.org/r/67291/
> -----------------------------------------------------------
> 
> (Updated May 24, 2018, 10:49 a.m.)
> 
> 
> Review request for mesos, Andrew Schwartzmeyer and James Peach.
> 
> 
> Repository: mesos
> 
> 
> Description
> -------
> 
> Used `$SUDO_USER` instead because `nobody` sometimes cannot access
> direcotries under `$HOME` of the current user running the tests.
> 
> 
> Diffs
> -----
> 
>   src/tests/container_logger_tests.cpp 7ec6f8701ecbc8f43ef41056fcbc17566c7db416 
>   src/tests/containerizer/capabilities_tests.cpp 734aa21c5bda19a1f8d958707249f2dc2b4de6d4

>   src/tests/containerizer/cgroups_isolator_tests.cpp 40c18a1528f2da32c608b6c774500933a08562ea

>   src/tests/containerizer/docker_containerizer_tests.cpp e37a9c11fe67846ceeeb6cfbf8a75d1e5753e185

>   src/tests/containerizer/mesos_containerizer_tests.cpp 01f2b38cfa67b144298c361e92170322864ac201

>   src/tests/containerizer/provisioner_docker_tests.cpp c664ff807583d587d94b0ab797330d5d3daf7657

>   src/tests/containerizer/volume_sandbox_path_isolator_tests.cpp 0400052a1c73ccc15c932c573cfb324ca83e2e59

>   src/tests/environment.cpp a5a255fc3e92991a201bb6cb4af9a625805395e0 
>   src/tests/fetcher_tests.cpp 95359ec84ed631bdd7b4fb5192e03f68cc57ed61 
>   src/tests/slave_tests.cpp 65d860594572b58a50a89358e31e97fd2a10bf08 
> 
> 
> Diff: https://reviews.apache.org/r/67291/diff/2/
> 
> 
> Testing
> -------
> 
> sudo make check
> 
> 
> Thanks,
> 
> Jie Yu
> 
>


Mime
  • Unnamed multipart/alternative (inline, None, 0 bytes)
View raw message