mesos-reviews mailing list archives

Site index · List index
Message view « Date » · « Thread »
Top « Date » · « Thread »
From Mesos Reviewbot Windows <revi...@mesos.apache.org>
Subject Re: Review Request 67280: Added libprocess example code to build.
Date Thu, 24 May 2018 14:27:14 GMT

-----------------------------------------------------------
This is an automatically generated e-mail. To reply, visit:
https://reviews.apache.org/r/67280/#review203765
-----------------------------------------------------------



FAIL: Some of the unit tests failed. Please check the relevant logs.

Reviews applied: `['67270', '67280']`

Failed command: `Start-MesosCITesting`

All the build artifacts available at: http://dcos-win.westus.cloudapp.azure.com/mesos-build/review/67280

Relevant logs:

- [mesos-tests-stdout.log](http://dcos-win.westus.cloudapp.azure.com/mesos-build/review/67280/logs/mesos-tests-stdout.log):

```
[       OK ] Endpoint/SlaveEndpointTest.NoAuthorizer/2 (123 ms)
[----------] 9 tests from Endpoint/SlaveEndpointTest (1073 ms total)

[----------] 2 tests from ContainerizerType/DefaultContainerDNSFlagTest
[ RUN      ] ContainerizerType/DefaultContainerDNSFlagTest.ValidateFlag/0
[       OK ] ContainerizerType/DefaultContainerDNSFlagTest.ValidateFlag/0 (32 ms)
[ RUN      ] ContainerizerType/DefaultContainerDNSFlagTest.ValidateFlag/1
[       OK ] ContainerizerType/DefaultContainerDNSFlagTest.ValidateFlag/1 (39 ms)
[----------] 2 tests from ContainerizerType/DefaultContainerDNSFlagTest (72 ms total)

[----------] 1 test from IsolationFlag/CpuIsolatorTest
[ RUN      ] IsolationFlag/CpuIsolatorTest.ROOT_UserCpuUsage/0
[       OK ] IsolationFlag/CpuIsolatorTest.ROOT_UserCpuUsage/0 (714 ms)
[----------] 1 test from IsolationFlag/CpuIsolatorTest (738 ms total)

[----------] 1 test from IsolationFlag/MemoryIsolatorTest
[ RUN      ] IsolationFlag/MemoryIsolatorTest.ROOT_MemUsage/0
[       OK ] IsolationFlag/MemoryIsolatorTest.ROOT_MemUsage/0 (730 ms)
[----------] 1 test from IsolationFlag/MemoryIsolatorTest (756 ms total)

[----------] Global test environment tear-down
[==========] 981 tests from 95 test cases ran. (457242 ms total)
[  PASSED  ] 980 tests.
[  FAILED  ] 1 test, listed below:
[  FAILED  ] DockerContainerizerHealthCheckTest.ROOT_DOCKER_DockerHealthStatusChange

 1 FAILED TEST
  YOU HAVE 220 DISABLED TESTS

```

- [mesos-tests-stderr.log](http://dcos-win.westus.cloudapp.azure.com/mesos-build/review/67280/logs/mesos-tests-stderr.log):

```
I0524 14:26:57.811573  1096 master.cpp:10843] Updating the state of task 59f01b76-34df-449c-b7c6-9dbb15562833
of framework f6480039-b1ed-4a2e-8d07-af9102b4b545-0000 (latest state: TASK_KILLED, status
update state: TASK_KILLED)
I0524 14:26:57.811573 22024 slave.cpp:3935] Shutting down framework f6480039-b1ed-4a2e-8d07-af9102b4b545-0000
I0524 14:26:57.811573 22024 slave.cpp:6656] Shutting down executor '59f01b76-34df-449c-b7c6-9dbbI0524
14:26:57.638581 21020 exec.cpp:162] Version: 1.7.0
I0524 14:26:57.666584 16300 exec.cpp:236] Executor registered on agent f6480039-b1ed-4a2e-8d07-af9102b4b545-S0
I0524 14:26:57.671579  7096 executor.cpp:178] Received SUBSCRIBED event
I0524 14:26:57.676570  7096 executor.cpp:182] Subscribed executor on windows-01.enofukwu14ruplxn0gs3yzmsgf.xx.internal.cloudapp.net
I0524 14:26:57.676570  7096 executor.cpp:178] Received LAUNCH event
I0524 14:26:57.682579  7096 executor.cpp:665] Starting task 59f01b76-34df-449c-b7c6-9dbb15562833
I0524 14:26:57.765583  7096 executor.cpp:485] Running 'D:\DCOS\mesos\src\mesos-containerizer.exe
launch <POSSIBLY-SENSITIVE-DATA>'
I0524 14:26:57.782577  7096 executor.cpp:678] Forked command at 16252
I0524 14:26:57.813585  6964 exec.cpp:445] Executor asked to shutdown
I0524 14:26:57.814581 20644 executor.cpp:178] Received SHUTDOWN event
I0524 14:26:57.814581 20644 executor.cpp:781] Shutting down
I0524 14:26:57.814581 20644 executor.cpp:894] Sending SIGTERM to process tree at pid 1615562833'
of framework f6480039-b1ed-4a2e-8d07-af9102b4b545-0000 at executor(1)@192.10.1.5:56055
I0524 14:26:57.813585 22024 slave.cpp:929] Agent terminating
W0524 14:26:57.813585 22024 slave.cpp:3931] Ignoring shutdown framework f6480039-b1ed-4a2e-8d07-af9102b4b545-0000
because it is terminating
I0524 14:26:57.813585  1096 master.cpp:10942] Removing task 59f01b76-34df-449c-b7c6-9dbb15562833
with resources cpus(allocated: *):4; mem(allocated: *):2048; disk(allocated: *):1024; ports(allocated:
*):[31000-32000] of framework f6480039-b1ed-4a2e-8d07-af9102b4b545-0000 on agent f6480039-b1ed-4a2e-8d07-af9102b4b545-S0
at slave(448)@192.10.1.5:56034 (windows-01.enofukwu14ruplxn0gs3yzmsgf.xx.internal.cloudapp.net)
I0524 14:26:57.816574 18552 master.cpp:1293] Agent f6480039-b1ed-4a2e-8d07-af9102b4b545-S0
at slave(448)@192.10.1.5:56034 (windows-01.enofukwu14ruplxn0gs3yzmsgf.xx.internal.cloudapp.net)
disconnected
I0524 14:26:57.816574 18552 master.cpp:3303] Disconnecting agent f6480039-b1ed-4a2e-8d07-af9102b4b545-S0
at slave(448)@192.10.1.5:56034 (windows-01.enofukwu14ruplxn0gs3yzmsgf.xx.internal.cloudapp.net)
I0524 14:26:57.817585 17128 hierarchical.cpp:344] Removed framework f6480039-b1ed-4a2e-8d07-af9102b4b545-0000
I0524 14:26:57.817585 18552 master.cpp:3322] Deactivating agent f6480039-b1ed-4a2e-8d07-af9102b4b545-S0
at slave(448)@192.10.1.5:56034 (windows-01.enofukwu14ruplxn0gs3yzmsgf.xx.internal.cloudapp.net)
I0524 14:26:57.818578 21952 hierarchical.cpp:766] Agent f6480039-b1ed-4a2e-8d07-af9102b4b545-S0
deactivated
I0524 14:26:57.818578  1096 containerizer.cpp:2401] Destroying container f37375d7-aa23-489d-afd6-383a388d0460
in RUNNING state
I0524 14:26:57.818578  1096 containerizer.cpp:3015] Transitioning the state of container f37375d7-aa23-489d-afd6-383a388d0460
from RUNNING to DESTROYING
I0524 14:26:57.819583  1096 launcher.cpp:156] Asked to destroy container f37375d7-aa23-489d-afd6-383a388d0460
I0524 14:26:57.841574 19516 containerizer.cpp:2854] Container f37375d7-aa23-489d-afd6-383a388d0460
has exited
I0524 14:26:57.873585 19504 master.cpp:1135] Master terminating
I0524 14:26:57.875588  5724 hierarchical.cpp:609] Removed agent f6480039-b1ed-4a2e-8d07-af9102b4b545-S0
I0524 14:26:58.326598 15180 process.cpp:940] Stopped the socket accept loop
```

- Mesos Reviewbot Windows


On May 24, 2018, 11:52 a.m., Benjamin Bannier wrote:
> 
> -----------------------------------------------------------
> This is an automatically generated e-mail. To reply, visit:
> https://reviews.apache.org/r/67280/
> -----------------------------------------------------------
> 
> (Updated May 24, 2018, 11:52 a.m.)
> 
> 
> Review request for mesos and Benno Evers.
> 
> 
> Repository: mesos
> 
> 
> Description
> -------
> 
> Added libprocess example code to build.
> 
> 
> Diffs
> -----
> 
>   3rdparty/libprocess/CMakeLists.txt 38522b1091a99141f75eccd7b54152bb40d00939 
>   3rdparty/libprocess/Makefile.am b1d77f3a7ab1426d873d1f1d886e3c255ce32379 
>   3rdparty/libprocess/examples/CMakeLists.txt PRE-CREATION 
> 
> 
> Diff: https://reviews.apache.org/r/67280/diff/1/
> 
> 
> Testing
> -------
> 
> `make check` (autotools, cmake)
> 
> 
> Thanks,
> 
> Benjamin Bannier
> 
>


Mime
  • Unnamed multipart/alternative (inline, None, 0 bytes)
View raw message