mesos-reviews mailing list archives

Site index · List index
Message view « Date » · « Thread »
Top « Date » · « Thread »
From Mesos Reviewbot Windows <revi...@mesos.apache.org>
Subject Re: Review Request 67137: Avoided leaking file descriptors in Mesos containerizer.
Date Thu, 24 May 2018 12:51:52 GMT

-----------------------------------------------------------
This is an automatically generated e-mail. To reply, visit:
https://reviews.apache.org/r/67137/#review203760
-----------------------------------------------------------



FAIL: Some of the unit tests failed. Please check the relevant logs.

Reviews applied: `['67137']`

Failed command: `Start-MesosCITesting`

All the build artifacts available at: http://dcos-win.westus.cloudapp.azure.com/mesos-build/review/67137

Relevant logs:

- [mesos-tests-stdout.log](http://dcos-win.westus.cloudapp.azure.com/mesos-build/review/67137/logs/mesos-tests-stdout.log):

```
[       OK ] Endpoint/SlaveEndpointTest.NoAuthorizer/2 (110 ms)
[----------] 9 tests from Endpoint/SlaveEndpointTest (1011 ms total)

[----------] 2 tests from ContainerizerType/DefaultContainerDNSFlagTest
[ RUN      ] ContainerizerType/DefaultContainerDNSFlagTest.ValidateFlag/0
[       OK ] ContainerizerType/DefaultContainerDNSFlagTest.ValidateFlag/0 (33 ms)
[ RUN      ] ContainerizerType/DefaultContainerDNSFlagTest.ValidateFlag/1
[       OK ] ContainerizerType/DefaultContainerDNSFlagTest.ValidateFlag/1 (38 ms)
[----------] 2 tests from ContainerizerType/DefaultContainerDNSFlagTest (73 ms total)

[----------] 1 test from IsolationFlag/CpuIsolatorTest
[ RUN      ] IsolationFlag/CpuIsolatorTest.ROOT_UserCpuUsage/0
[       OK ] IsolationFlag/CpuIsolatorTest.ROOT_UserCpuUsage/0 (749 ms)
[----------] 1 test from IsolationFlag/CpuIsolatorTest (773 ms total)

[----------] 1 test from IsolationFlag/MemoryIsolatorTest
[ RUN      ] IsolationFlag/MemoryIsolatorTest.ROOT_MemUsage/0
[       OK ] IsolationFlag/MemoryIsolatorTest.ROOT_MemUsage/0 (730 ms)
[----------] 1 test from IsolationFlag/MemoryIsolatorTest (755 ms total)

[----------] Global test environment tear-down
[==========] 981 tests from 95 test cases ran. (458628 ms total)
[  PASSED  ] 980 tests.
[  FAILED  ] 1 test, listed below:
[  FAILED  ] DockerContainerizerHealthCheckTest.ROOT_DOCKER_DockerHealthStatusChange

 1 FAILED TEST
  YOU HAVE 220 DISABLED TESTS

```

- [mesos-tests-stderr.log](http://dcos-win.westus.cloudapp.azure.com/mesos-build/review/67137/logs/mesos-tests-stderr.log):

```
I0524 12:51:37.738133 18444 master.cpp:10843] Updating the state of task fec4d662-dbde-4a9d-806f-1d874cba27b5
of framework 665c8921-e1fd-47fd-8df4-4684561c6b32-0000 (latest state: TASK_KILLED, status
update state: TASK_KILLED)
I0524 12:51:37.738133 20348 slave.cpp:3935] Shutting down framework 665c8921-e1fd-47fd-8df4-4684561c6b32-0000
I0524 12:51:37.738133 20348 slave.cpp:6656] Shutting down executor 'fec4d662-dbde-4a9d-806f-1d874cba27b5'
of framework 665c8921-e1fd-47fd-8df4-4684561c6b32-0000 at executor(1)@192.10.1.5:51222
I0524 12:51:37.740131 20348 slave.cpp:929] Agent terminating
W0524 12:51:37.740131 20348 slave.cpp:3931]I0524 12:51:37.562160 15080 exec.cpp:162] Version:
1.7.0
I0524 12:51:37.588127 16544 exec.cpp:236] Executor registered on agent 665c8921-e1fd-47fd-8df4-4684561c6b32-S0
I0524 12:51:37.592159 18800 executor.cpp:178] Received SUBSCRIBED event
I0524 12:51:37.597162 18800 executor.cpp:182] Subscribed executor on windows-01.enofukwu14ruplxn0gs3yzmsgf.xx.internal.cloudapp.net
I0524 12:51:37.598161 18800 executor.cpp:178] Received LAUNCH event
I0524 12:51:37.602129 18800 executor.cpp:665] Starting task fec4d662-dbde-4a9d-806f-1d874cba27b5
I0524 12:51:37.693156 18800 executor.cpp:485] Running 'D:\DCOS\mesos\src\mesos-containerizer.exe
launch <POSSIBLY-SENSITIVE-DATA>'
I0524 12:51:37.711122 18800 executor.cpp:678] Forked command at 19000
I0524 12:51:37.740131 21464 exec.cpp:445] Executor asked to shutdown
I0524 12:51:37.741142 20788 executor.cpp:178] Received SHUTDOWN event
I0524 12:51:37.741142 20788 executor.cpp:781] Shutting down
I0524 12:51:37.741142 20788 executor.cpp:894] Sending SIGTERM to process tree at pid 19 Ignoring
shutdown framework 665c8921-e1fd-47fd-8df4-4684561c6b32-0000 because it is terminating
I0524 12:51:37.741142 18444 master.cpp:10942] Removing task fec4d662-dbde-4a9d-806f-1d874cba27b5
with resources cpus(allocated: *):4; mem(allocated: *):2048; disk(allocated: *):1024; ports(allocated:
*):[31000-32000] of framework 665c8921-e1fd-47fd-8df4-4684561c6b32-0000 on agent 665c8921-e1fd-47fd-8df4-4684561c6b32-S0
at slave(448)@192.10.1.5:51201 (windows-01.enofukwu14ruplxn0gs3yzmsgf.xx.internal.cloudapp.net)
I0524 12:51:37.744154 18444 master.cpp:1293] Agent 665c8921-e1fd-47fd-8df4-4684561c6b32-S0
at slave(448)@192.10.1.5:51201 (windows-01.enofukwu14ruplxn0gs3yzmsgf.xx.internal.cloudapp.net)
disconnected
I0524 12:51:37.744154 18444 master.cpp:3303] Disconnecting agent 665c8921-e1fd-47fd-8df4-4684561c6b32-S0
at slave(448)@192.10.1.5:51201 (windows-01.enofukwu14ruplxn0gs3yzmsgf.xx.internal.cloudapp.net)
I0524 12:51:37.745160 18444 master.cpp:3322] Deactivating agent 665c8921-e1fd-47fd-8df4-4684561c6b32-S0
at slave(448)@192.10.1.5:51201 (windows-01.enofukwu14ruplxn0gs3yzmsgf.xx.internal.cloudapp.net)
I0524 12:51:37.745160 17880 hierarchical.cpp:344] Removed framework 665c8921-e1fd-47fd-8df4-4684561c6b32-0000
I0524 12:51:37.745160 18584 hierarchical.cpp:766] Agent 665c8921-e1fd-47fd-8df4-4684561c6b32-S0
deactivated
I0524 12:51:37.746134 17316 containerizer.cpp:2401] Destroying container f94d388a-955a-4666-bc7d-d2dcf2e3ffa6
in RUNNING state
I0524 12:51:37.746134 17316 containerizer.cpp:3015] Transitioning the state of container f94d388a-955a-4666-bc7d-d2dcf2e3ffa6
from RUNNING to DESTROYING
I0524 12:51:37.746134 17316 launcher.cpp:156] Asked to destroy container f94d388a-955a-4666-bc7d-d2dcf2e3ffa6
I0524 12:51:37.789024 19576 containerizer.cpp:2854] Container f94d388a-955a-4666-bc7d-d2dcf2e3ffa6
has exited
I0524 12:51:37.821025 21424 master.cpp:1135] Master terminating
I0524 12:51:37.823992 14648 hierarchical.cpp:609] Removed agent 665c8921-e1fd-47fd-8df4-4684561c6b32-S0
I0524 12:51:38.258020 21304 process.cpp:940] Stopped the socket accept loop
```

- Mesos Reviewbot Windows


On May 24, 2018, 1:13 p.m., Benjamin Bannier wrote:
> 
> -----------------------------------------------------------
> This is an automatically generated e-mail. To reply, visit:
> https://reviews.apache.org/r/67137/
> -----------------------------------------------------------
> 
> (Updated May 24, 2018, 1:13 p.m.)
> 
> 
> Review request for mesos, Gilbert Song, Jie Yu, and James Peach.
> 
> 
> Bugs: MESOS-8917
>     https://issues.apache.org/jira/browse/MESOS-8917
> 
> 
> Repository: mesos
> 
> 
> Description
> -------
> 
> Avoided leaking file descriptors in Mesos containerizer.
> 
> 
> Diffs
> -----
> 
>   src/slave/containerizer/mesos/launch.cpp f25d90651ef32495c9161c3eaed8a327d1b2b926 
> 
> 
> Diff: https://reviews.apache.org/r/67137/diff/8/
> 
> 
> Testing
> -------
> 
> `make check`
> 
> I still need to confirm this patch in CI on a wider range of scenarios.
> 
> 
> Thanks,
> 
> Benjamin Bannier
> 
>


Mime
  • Unnamed multipart/alternative (inline, None, 0 bytes)
View raw message