mesos-reviews mailing list archives

Site index · List index
Message view « Date » · « Thread »
Top « Date » · « Thread »
From Mesos Reviewbot Windows <revi...@mesos.apache.org>
Subject Re: Review Request 67235: Added per-framework metrics for types of resources contained in offers.
Date Thu, 24 May 2018 01:07:58 GMT

-----------------------------------------------------------
This is an automatically generated e-mail. To reply, visit:
https://reviews.apache.org/r/67235/#review203724
-----------------------------------------------------------



FAIL: Some of the unit tests failed. Please check the relevant logs.

Reviews applied: `['66882', '66819', '66820', '66822', '66823', '66845', '66825', '66846',
'66847', '66841', '66842', '66843', '67147', '66844', '66855', '66861', '66856', '66870',
'66874', '67043', '66883', '67187', '67235']`

Failed command: `Start-MesosCITesting`

All the build artifacts available at: http://dcos-win.westus.cloudapp.azure.com/mesos-build/review/67235

Relevant logs:

- [mesos-tests-stdout.log](http://dcos-win.westus.cloudapp.azure.com/mesos-build/review/67235/logs/mesos-tests-stdout.log):

```
[       OK ] Endpoint/SlaveEndpointTest.NoAuthorizer/2 (119 ms)
[----------] 9 tests from Endpoint/SlaveEndpointTest (1020 ms total)

[----------] 2 tests from ContainerizerType/DefaultContainerDNSFlagTest
[ RUN      ] ContainerizerType/DefaultContainerDNSFlagTest.ValidateFlag/0
[       OK ] ContainerizerType/DefaultContainerDNSFlagTest.ValidateFlag/0 (36 ms)
[ RUN      ] ContainerizerType/DefaultContainerDNSFlagTest.ValidateFlag/1
[       OK ] ContainerizerType/DefaultContainerDNSFlagTest.ValidateFlag/1 (40 ms)
[----------] 2 tests from ContainerizerType/DefaultContainerDNSFlagTest (78 ms total)

[----------] 1 test from IsolationFlag/CpuIsolatorTest
[ RUN      ] IsolationFlag/CpuIsolatorTest.ROOT_UserCpuUsage/0
[       OK ] IsolationFlag/CpuIsolatorTest.ROOT_UserCpuUsage/0 (753 ms)
[----------] 1 test from IsolationFlag/CpuIsolatorTest (777 ms total)

[----------] 1 test from IsolationFlag/MemoryIsolatorTest
[ RUN      ] IsolationFlag/MemoryIsolatorTest.ROOT_MemUsage/0
[       OK ] IsolationFlag/MemoryIsolatorTest.ROOT_MemUsage/0 (733 ms)
[----------] 1 test from IsolationFlag/MemoryIsolatorTest (758 ms total)

[----------] Global test environment tear-down
[==========] 981 tests from 95 test cases ran. (442695 ms total)
[  PASSED  ] 980 tests.
[  FAILED  ] 1 test, listed below:
[  FAILED  ] DockerContainerizerHealthCheckTest.ROOT_DOCKER_DockerHealthStatusChange

 1 FAILED TEST
  YOU HAVE 220 DISABLED TESTS

```

- [mesos-tests-stderr.log](http://dcos-win.westus.cloudapp.azure.com/mesos-build/review/67235/logs/mesos-tests-stderr.log):

```
I0524 01:07:36.243073 12688 exec.cpp:236] Executor registered on agent af4c0c0f-2035-4c29-a19f-8501b28595d4-S0
I0524 01:07:36.247076  7304 executor.cpp:178] Received SUBSCRIBED event
I0524 01:07:36.251077  7304 executor.cpp:182] Subscribed executor on windows-02.enofukwu14ruplxn0gs3yzmsgf.xx.internal.cloudapp.net
I0524 01:07:36.252076  7304 executor.cpp:178] Received LAUNCH event
I0524 01:07:36.256086  7304 executor.cpp:665] Starting task ad106be2-4431-4931-96fc-7963fcb16d23
I0524 01:07:36.334095  7304 executor.cpp:485] Running 'D:\DCOS\mesos\src\mesos-containerizer.exe
launch <POSSIBLY-SENSITIVE-DATA>'
I0524 01:07:36.351090  7304 executor.cpp:678] Forked command at 20204
I0524 01:07:36.378093  6588 exec.cpp:445] Executor asked to shutdown
I0524 01:07:36.379086 18944 executor.cpp:178] Received SHUTDOWN event
I0524 01:07:36.379086 18944 executor.cpp:781] Shutting down
I0524 01:07:36.379086 18944 executor.cpp:894] Sending SIGTERM to process tree at pid 20035-4c29-a19f-8501b28595d4-0000
I0524 01:07:36.376090 20572 slave.cpp:3935] Shutting down framework af4c0c0f-2035-4c29-a19f-8501b28595d4-0000
I0524 01:07:36.376090 20496 master.cpp:10886] Updating the state of task ad106be2-4431-4931-96fc-7963fcb16d23
of framework af4c0c0f-2035-4c29-a19f-8501b28595d4-0000 (latest state: TASK_KILLED, status
update state: TASK_KILLED)
I0524 01:07:36.377100 20572 slave.cpp:6656] Shutting down executor 'ad106be2-4431-4931-96fc-7963fcb16d23'
of framework af4c0c0f-2035-4c29-a19f-8501b28595d4-0000 at executor(1)@192.10.1.6:55181
I0524 01:07:36.378093 20572 slave.cpp:929] Agent terminating
W0524 01:07:36.378093 20572 slave.cpp:3931] Ignoring shutdown framework af4c0c0f-2035-4c29-a19f-8501b28595d4-0000
because it is terminating
I0524 01:07:36.380089 20496 master.cpp:10975] Removing task ad106be2-4431-4931-96fc-7963fcb16d23
with resources cpus(allocated: *):4; mem(allocated: *):2048; disk(allocated: *):1024; ports(allocated:
*):[31000-32000] of framework af4c0c0f-2035-4c29-a19f-8501b28595d4-0000 on agent af4c0c0f-2035-4c29-a19f-8501b28595d4-S0
at slave(448)@192.10.1.6:55160 (windows-02.enofukwu14ruplxn0gs3yzmsgf.xx.internal.cloudapp.net)
I0524 01:07:36.383090 15248 containerizer.cpp:2401] Destroying container f3a42156-04a9-42d1-9280-097667eecce1
in RUNNING state
I0524 01:07:36.383090 15248 containerizer.cpp:3015] Transitioning the state of container f3a42156-04a9-42d1-9280-097667eecce1
from RUNNING to DESTROYING
I0524 01:07:36.383090 20496 master.cpp:1301] Agent af4c0c0f-2035-4c29-a19f-8501b28595d4-S0
at slave(448)@192.10.1.6:55160 (windows-02.enofukwu14ruplxn0gs3yzmsgf.xx.internal.cloudapp.net)
disconnected
I0524 01:07:36.383090 20496 master.cpp:3317] Disconnecting agent af4c0c0f-2035-4c29-a19f-8501b28595d4-S0
at slave(448)@192.10.1.6:55160 (windows-02.enofukwu14ruplxn0gs3yzmsgf.xx.internal.cloudapp.net)
I0524 01:07:36.383090 20496 master.cpp:3336] Deactivating agent af4c0c0f-2035-4c29-a19f-8501b28595d4-S0
at slave(448)@192.10.1.6:55160 (windows-02.enofukwu14ruplxn0gs3yzmsgf.xx.internal.cloudapp.net)
I0524 01:07:36.384095 19260 hierarchical.cpp:357] Removed framework af4c0c0f-2035-4c29-a19f-8501b28595d4-0000
I0524 01:07:36.384095 15248 launcher.cpp:156] Asked to destroy container f3a42156-04a9-42d1-9280-097667eecce1
I0524 01:07:36.384095 20096 hierarchical.cpp:790] Agent af4c0c0f-2035-4c29-a19f-8501b28595d4-S0
deactivated
I0524 01:07:36.454092 19868 containerizer.cpp:2854] Container f3a42156-04a9-42d1-9280-097667eecce1
has exited
I0524 01:07:36.484095  7160 master.cpp:1143] Master terminating
I0524 01:07:36.485091 20096 hierarchical.cpp:632] Removed agent af4c0c0f-2035-4c29-a19f-8501b28595d4-S0
I0524 01:07:36.895100 16496 process.cpp:940] Stopped the socket accept loop
```

- Mesos Reviewbot Windows


On May 24, 2018, 12:14 a.m., Greg Mann wrote:
> 
> -----------------------------------------------------------
> This is an automatically generated e-mail. To reply, visit:
> https://reviews.apache.org/r/67235/
> -----------------------------------------------------------
> 
> (Updated May 24, 2018, 12:14 a.m.)
> 
> 
> Review request for mesos, Benjamin Mahler, Gaston Kleiman, Gilbert Song, and Vinod Kone.
> 
> 
> Bugs: MESOS-8940
>     https://issues.apache.org/jira/browse/MESOS-8940
> 
> 
> Repository: mesos
> 
> 
> Description
> -------
> 
> Added per-framework metrics for types of resources contained in offers.
> 
> 
> Diffs
> -----
> 
>   src/master/master.cpp 41862db9900acde85a62d2fea85459691c68556e 
>   src/master/metrics.hpp ec76dbcd1d1fa5349d62ce73fb9603e1986a776b 
>   src/master/metrics.cpp e46ead79f3f29e285426f9d061337077f453aa45 
>   src/tests/master_tests.cpp 6a0fa988aebaf1cf66abaaca0c628f981c6ccc31 
> 
> 
> Diff: https://reviews.apache.org/r/67235/diff/4/
> 
> 
> Testing
> -------
> 
> 
> Thanks,
> 
> Greg Mann
> 
>


Mime
  • Unnamed multipart/alternative (inline, None, 0 bytes)
View raw message