mesos-reviews mailing list archives

Site index · List index
Message view « Date » · « Thread »
Top « Date » · « Thread »
From Mesos Reviewbot Windows <revi...@mesos.apache.org>
Subject Re: Review Request 67137: Avoided leaking file descriptors in Mesos containerizer.
Date Wed, 23 May 2018 23:17:01 GMT

-----------------------------------------------------------
This is an automatically generated e-mail. To reply, visit:
https://reviews.apache.org/r/67137/#review203708
-----------------------------------------------------------



FAIL: Some of the unit tests failed. Please check the relevant logs.

Reviews applied: `['67137']`

Failed command: `Start-MesosCITesting`

All the build artifacts available at: http://dcos-win.westus.cloudapp.azure.com/mesos-build/review/67137

Relevant logs:

- [mesos-tests-stdout.log](http://dcos-win.westus.cloudapp.azure.com/mesos-build/review/67137/logs/mesos-tests-stdout.log):

```
[       OK ] Endpoint/SlaveEndpointTest.NoAuthorizer/2 (107 ms)
[----------] 9 tests from Endpoint/SlaveEndpointTest (1015 ms total)

[----------] 2 tests from ContainerizerType/DefaultContainerDNSFlagTest
[ RUN      ] ContainerizerType/DefaultContainerDNSFlagTest.ValidateFlag/0
[       OK ] ContainerizerType/DefaultContainerDNSFlagTest.ValidateFlag/0 (36 ms)
[ RUN      ] ContainerizerType/DefaultContainerDNSFlagTest.ValidateFlag/1
[       OK ] ContainerizerType/DefaultContainerDNSFlagTest.ValidateFlag/1 (38 ms)
[----------] 2 tests from ContainerizerType/DefaultContainerDNSFlagTest (76 ms total)

[----------] 1 test from IsolationFlag/CpuIsolatorTest
[ RUN      ] IsolationFlag/CpuIsolatorTest.ROOT_UserCpuUsage/0
[       OK ] IsolationFlag/CpuIsolatorTest.ROOT_UserCpuUsage/0 (749 ms)
[----------] 1 test from IsolationFlag/CpuIsolatorTest (774 ms total)

[----------] 1 test from IsolationFlag/MemoryIsolatorTest
[ RUN      ] IsolationFlag/MemoryIsolatorTest.ROOT_MemUsage/0
[       OK ] IsolationFlag/MemoryIsolatorTest.ROOT_MemUsage/0 (732 ms)
[----------] 1 test from IsolationFlag/MemoryIsolatorTest (756 ms total)

[----------] Global test environment tear-down
[==========] 981 tests from 95 test cases ran. (450749 ms total)
[  PASSED  ] 980 tests.
[  FAILED  ] 1 test, listed below:
[  FAILED  ] DockerContainerizerHealthCheckTest.ROOT_DOCKER_DockerHealthStatusChange

 1 FAILED TEST
  YOU HAVE 220 DISABLED TESTS

```

- [mesos-tests-stderr.log](http://dcos-win.westus.cloudapp.azure.com/mesos-build/review/67137/logs/mesos-tests-stderr.log):

```
I0523 23:16:45.978835 16352 slave.cpp:3935] Shutting down framework 9e50e61d-b2c0-442e-8fae-c4b07d321c67-0000
I0523 23:16:45.978835 13752 master.cpp:10843] Updating the state of task 089c335a-f751-4525-952c-d80c8acae597
of framework 9e50e61d-b2c0-442e-8fae-c4b07d321c67-0000 (latest state: TASK_KILLED, status
update state: TASK_KILLED)
I0523 23:16:45.978835 16352 slave.cpp:6656] Shutting down executor '089c335a-f751-4525-952c-d80c8acae597'
of framework 9e50e61d-b2c0-442e-8fae-c4b07d321c67-0000 at executor(1)@192.10.1.6:49861
I0523 23:16:45.979831 16352 slave.cpp:929] Agent termiI0523 23:16:45.809881 10592 exec.cpp:162]
Version: 1.7.0
I0523 23:16:45.835820 16940 exec.cpp:236] Executor registered on agent 9e50e61d-b2c0-442e-8fae-c4b07d321c67-S0
I0523 23:16:45.839828 11724 executor.cpp:178] Received SUBSCRIBED event
I0523 23:16:45.843883 11724 executor.cpp:182] Subscribed executor on windows-02.enofukwu14ruplxn0gs3yzmsgf.xx.internal.cloudapp.net
I0523 23:16:45.844831 11724 executor.cpp:178] Received LAUNCH event
I0523 23:16:45.849834 11724 executor.cpp:665] Starting task 089c335a-f751-4525-952c-d80c8acae597
I0523 23:16:45.935832 11724 executor.cpp:485] Running 'D:\DCOS\mesos\src\mesos-containerizer.exe
launch <POSSIBLY-SENSITIVE-DATA>'
I0523 23:16:45.952850 11724 executor.cpp:678] Forked command at 21248
I0523 23:16:45.979831 20364 exec.cpp:445] Executor asked to shutdown
I0523 23:16:45.980832 15596 executor.cpp:178] Received SHUTDOWN event
I0523 23:16:45.980832 15596 executor.cpp:781] Shutting down
I0523 23:16:45.980832 15596 executor.cpp:894] Sending SIGTERM to process tree at pid 21nating
W0523 23:16:45.980832 16352 slave.cpp:3931] Ignoring shutdown framework 9e50e61d-b2c0-442e-8fae-c4b07d321c67-0000
because it is terminating
I0523 23:16:45.980832 13752 master.cpp:10942] Removing task 089c335a-f751-4525-952c-d80c8acae597
with resources cpus(allocated: *):4; mem(allocated: *):2048; disk(allocated: *):1024; ports(allocated:
*):[31000-32000] of framework 9e50e61d-b2c0-442e-8fae-c4b07d321c67-0000 on agent 9e50e61d-b2c0-442e-8fae-c4b07d321c67-S0
at slave(448)@192.10.1.6:49840 (windows-02.enofukwu14ruplxn0gs3yzmsgf.xx.internal.cloudapp.net)
I0523 23:16:45.983832 13752 master.cpp:1293] Agent 9e50e61d-b2c0-442e-8fae-c4b07d321c67-S0
at slave(448)@192.10.1.6:49840 (windows-02.enofukwu14ruplxn0gs3yzmsgf.xx.internal.cloudapp.net)
disconnected
I0523 23:16:45.983832 13752 master.cpp:3303] Disconnecting agent 9e50e61d-b2c0-442e-8fae-c4b07d321c67-S0
at slave(448)@192.10.1.6:49840 (windows-02.enofukwu14ruplxn0gs3yzmsgf.xx.internal.cloudapp.net)
I0523 23:16:45.983832 13752 master.cpp:3322] Deactivating agent 9e50e61d-b2c0-442e-8fae-c4b07d321c67-S0
at slave(448)@192.10.1.6:49840 (windows-02.enofukwu14ruplxn0gs3yzmsgf.xx.internal.cloudapp.net)
I0523 23:16:45.984830  1812 hierarchical.cpp:344] Removed framework 9e50e61d-b2c0-442e-8fae-c4b07d321c67-0000
I0523 23:16:45.984830  1812 hierarchical.cpp:766] Agent 9e50e61d-b2c0-442e-8fae-c4b07d321c67-S0
deactivated
I0523 23:16:45.985832 17976 containerizer.cpp:2401] Destroying container b19a1a2b-5f80-4a48-99e3-a1ec7e3c023a
in RUNNING state
I0523 23:16:45.985832 17976 containerizer.cpp:3015] Transitioning the state of container b19a1a2b-5f80-4a48-99e3-a1ec7e3c023a
from RUNNING to DESTROYING
I0523 23:16:45.985832 17976 launcher.cpp:156] Asked to destroy container b19a1a2b-5f80-4a48-99e3-a1ec7e3c023a
I0523 23:16:46.027428 17768 containerizer.cpp:2854] Container b19a1a2b-5f80-4a48-99e3-a1ec7e3c023a
has exited
I0523 23:16:46.057520 19060 master.cpp:1135] Master terminating
I0523 23:16:46.059525 20224 hierarchical.cpp:609] Removed agent 9e50e61d-b2c0-442e-8fae-c4b07d321c67-S0
I0523 23:16:46.464532 15880 process.cpp:940] Stopped the socket accept loop
```

- Mesos Reviewbot Windows


On May 23, 2018, 3:25 p.m., Benjamin Bannier wrote:
> 
> -----------------------------------------------------------
> This is an automatically generated e-mail. To reply, visit:
> https://reviews.apache.org/r/67137/
> -----------------------------------------------------------
> 
> (Updated May 23, 2018, 3:25 p.m.)
> 
> 
> Review request for mesos, Gilbert Song, Jie Yu, and James Peach.
> 
> 
> Bugs: MESOS-8917
>     https://issues.apache.org/jira/browse/MESOS-8917
> 
> 
> Repository: mesos
> 
> 
> Description
> -------
> 
> Avoided leaking file descriptors in Mesos containerizer.
> 
> 
> Diffs
> -----
> 
>   src/slave/containerizer/mesos/launch.cpp f25d90651ef32495c9161c3eaed8a327d1b2b926 
> 
> 
> Diff: https://reviews.apache.org/r/67137/diff/7/
> 
> 
> Testing
> -------
> 
> `make check`
> 
> I still need to confirm this patch in CI on a wider range of scenarios.
> 
> 
> Thanks,
> 
> Benjamin Bannier
> 
>


Mime
  • Unnamed multipart/alternative (inline, None, 0 bytes)
View raw message