mesos-reviews mailing list archives

Site index · List index
Message view « Date » · « Thread »
Top « Date » · « Thread »
From Mesos Reviewbot Windows <revi...@mesos.apache.org>
Subject Re: Review Request 67271: Change ambiguous parameter name.
Date Wed, 23 May 2018 18:56:45 GMT

-----------------------------------------------------------
This is an automatically generated e-mail. To reply, visit:
https://reviews.apache.org/r/67271/#review203677
-----------------------------------------------------------



FAIL: Some of the unit tests failed. Please check the relevant logs.

Reviews applied: `['67195', '67271']`

Failed command: `Start-MesosCITesting`

All the build artifacts available at: http://dcos-win.westus.cloudapp.azure.com/mesos-build/review/67271

Relevant logs:

- [mesos-tests-stdout.log](http://dcos-win.westus.cloudapp.azure.com/mesos-build/review/67271/logs/mesos-tests-stdout.log):

```
[       OK ] Endpoint/SlaveEndpointTest.NoAuthorizer/2 (110 ms)
[----------] 9 tests from Endpoint/SlaveEndpointTest (1022 ms total)

[----------] 2 tests from ContainerizerType/DefaultContainerDNSFlagTest
[ RUN      ] ContainerizerType/DefaultContainerDNSFlagTest.ValidateFlag/0
[       OK ] ContainerizerType/DefaultContainerDNSFlagTest.ValidateFlag/0 (34 ms)
[ RUN      ] ContainerizerType/DefaultContainerDNSFlagTest.ValidateFlag/1
[       OK ] ContainerizerType/DefaultContainerDNSFlagTest.ValidateFlag/1 (39 ms)
[----------] 2 tests from ContainerizerType/DefaultContainerDNSFlagTest (74 ms total)

[----------] 1 test from IsolationFlag/CpuIsolatorTest
[ RUN      ] IsolationFlag/CpuIsolatorTest.ROOT_UserCpuUsage/0
[       OK ] IsolationFlag/CpuIsolatorTest.ROOT_UserCpuUsage/0 (734 ms)
[----------] 1 test from IsolationFlag/CpuIsolatorTest (761 ms total)

[----------] 1 test from IsolationFlag/MemoryIsolatorTest
[ RUN      ] IsolationFlag/MemoryIsolatorTest.ROOT_MemUsage/0
[       OK ] IsolationFlag/MemoryIsolatorTest.ROOT_MemUsage/0 (727 ms)
[----------] 1 test from IsolationFlag/MemoryIsolatorTest (751 ms total)

[----------] Global test environment tear-down
[==========] 981 tests from 95 test cases ran. (431186 ms total)
[  PASSED  ] 980 tests.
[  FAILED  ] 1 test, listed below:
[  FAILED  ] DockerContainerizerHealthCheckTest.ROOT_DOCKER_DockerHealthStatusChange

 1 FAILED TEST
  YOU HAVE 220 DISABLED TESTS

```

- [mesos-tests-stderr.log](http://dcos-win.westus.cloudapp.azure.com/mesos-build/review/67271/logs/mesos-tests-stderr.log):

```
I0523 18:56:29.551527 15372 master.cpp:10843] Updating the state of task 92149558-c5dd-44ea-94fe-b15020b46980
of framework ff5cedc5-a250-4b23-871c-bc2ae93fc0b3-0000 (latest state: TASK_KILLED, status
update state: TASK_KILLED)
I0523 18:56:29.551527 14796 slave.cpp:3935] Shutting downI0523 18:56:29.363566 20124 exec.cpp:162]
Version: 1.7.0
I0523 18:56:29.390091 14192 exec.cpp:236] Executor registered on agent ff5cedc5-a250-4b23-871c-bc2ae93fc0b3-S0
I0523 18:56:29.393568  7692 executor.cpp:178] Received SUBSCRIBED event
I0523 18:56:29.398567  7692 executor.cpp:182] Subscribed executor on windows-02.enofukwu14ruplxn0gs3yzmsgf.xx.internal.cloudapp.net
I0523 18:56:29.398567  7692 executor.cpp:178] Received LAUNCH event
I0523 18:56:29.403540  7692 executor.cpp:665] Starting task 92149558-c5dd-44ea-94fe-b15020b46980
I0523 18:56:29.495543  7692 executor.cpp:485] Running 'D:\DCOS\mesos\src\mesos-containerizer.exe
launch <POSSIBLY-SENSITIVE-DATA>'
I0523 18:56:29.523576  7692 executor.cpp:678] Forked command at 2632
I0523 18:56:29.554531 13184 exec.cpp:445] Executor asked to shutdown
I0523 18:56:29.554531 18912 executor.cpp:178] Received SHUTDOWN event
I0523 18:56:29.554531 18912 executor.cpp:781] Shutting down
I0523 18:56:29.554531 18912 executor.cpp:894] Sending SIGTERM to process tree at pid 263 framework
ff5cedc5-a250-4b23-871c-bc2ae93fc0b3-0000
I0523 18:56:29.552546 14796 slave.cpp:6656] Shutting down executor '92149558-c5dd-44ea-94fe-b15020b46980'
of framework ff5cedc5-a250-4b23-871c-bc2ae93fc0b3-0000 at executor(1)@192.10.1.6:60958
I0523 18:56:29.554531 14796 slave.cpp:929] Agent terminating
W0523 18:56:29.554531 14796 slave.cpp:3931] Ignoring shutdown framework ff5cedc5-a250-4b23-871c-bc2ae93fc0b3-0000
because it is terminating
I0523 18:56:29.554531 15372 master.cpp:10942] Removing task 92149558-c5dd-44ea-94fe-b15020b46980
with resources cpus(allocated: *):4; mem(allocated: *):2048; disk(allocated: *):1024; ports(allocated:
*):[31000-32000] of framework ff5cedc5-a250-4b23-871c-bc2ae93fc0b3-0000 on agent ff5cedc5-a250-4b23-871c-bc2ae93fc0b3-S0
at slave(448)@192.10.1.6:60937 (windows-02.enofukwu14ruplxn0gs3yzmsgf.xx.internal.cloudapp.net)
I0523 18:56:29.558531 15372 master.cpp:1293] Agent ff5cedc5-a250-4b23-871c-bc2ae93fc0b3-S0
at slave(448)@192.10.1.6:60937 (windows-02.enofukwu14ruplxn0gs3yzmsgf.xx.internal.cloudapp.net)
disconnected
I0523 18:56:29.558531 15372 master.cpp:3303] Disconnecting agent ff5cedc5-a250-4b23-871c-bc2ae93fc0b3-S0
at slave(448)@192.10.1.6:60937 (windows-02.enofukwu14ruplxn0gs3yzmsgf.xx.internal.cloudapp.net)
I0523 18:56:29.558531  9556 hierarchical.cpp:344] Removed framework ff5cedc5-a250-4b23-871c-bc2ae93fc0b3-0000
I0523 18:56:29.558531 15372 master.cpp:3322] Deactivating agent ff5cedc5-a250-4b23-871c-bc2ae93fc0b3-S0
at slave(448)@192.10.1.6:60937 (windows-02.enofukwu14ruplxn0gs3yzmsgf.xx.internal.cloudapp.net)
I0523 18:56:29.559530 19024 hierarchical.cpp:766] Agent ff5cedc5-a250-4b23-871c-bc2ae93fc0b3-S0
deactivated
I0523 18:56:29.559530  1920 containerizer.cpp:2382] Destroying container a652f34e-0eea-4eca-83c6-8b0d98c391eb
in RUNNING state
I0523 18:56:29.559530  1920 containerizer.cpp:2996] Transitioning the state of container a652f34e-0eea-4eca-83c6-8b0d98c391eb
from RUNNING to DESTROYING
I0523 18:56:29.560529  1920 launcher.cpp:156] Asked to destroy container a652f34e-0eea-4eca-83c6-8b0d98c391eb
I0523 18:56:29.574223 13144 containerizer.cpp:2835] Container a652f34e-0eea-4eca-83c6-8b0d98c391eb
has exited
I0523 18:56:29.605613 15832 master.cpp:1135] Master terminating
I0523 18:56:29.607210  1920 hierarchical.cpp:609] Removed agent ff5cedc5-a250-4b23-871c-bc2ae93fc0b3-S0
I0523 18:56:30.019217 13068 process.cpp:940] Stopped the socket accept loop
```

- Mesos Reviewbot Windows


On May 23, 2018, 6:42 p.m., Xudong Ni wrote:
> 
> -----------------------------------------------------------
> This is an automatically generated e-mail. To reply, visit:
> https://reviews.apache.org/r/67271/
> -----------------------------------------------------------
> 
> (Updated May 23, 2018, 6:42 p.m.)
> 
> 
> Review request for mesos and James Peach.
> 
> 
> Bugs: MESOS-8340
>     https://issues.apache.org/jira/browse/MESOS-8340
> 
> 
> Repository: mesos
> 
> 
> Description
> -------
> 
> Change ambiguous parameter name.
> 
> 
> Diffs
> -----
> 
>   src/slave/containerizer/mesos/isolators/network/ports.hpp ba71087194a3ae74c7e40dffa9c108b02ffa10ad

>   src/slave/containerizer/mesos/isolators/network/ports.cpp 1f84ed4fb2a30fd095e2faec1038de1fa19a15c5

> 
> 
> Diff: https://reviews.apache.org/r/67271/diff/2/
> 
> 
> Testing
> -------
> 
> 
> Thanks,
> 
> Xudong Ni
> 
>


Mime
  • Unnamed multipart/alternative (inline, None, 0 bytes)
View raw message