mesos-reviews mailing list archives

Site index · List index
Message view « Date » · « Thread »
Top « Date » · « Thread »
From Mesos Reviewbot Windows <revi...@mesos.apache.org>
Subject Re: Review Request 67270: Fixed compilation error in libprocess example.
Date Wed, 23 May 2018 18:11:43 GMT

-----------------------------------------------------------
This is an automatically generated e-mail. To reply, visit:
https://reviews.apache.org/r/67270/#review203674
-----------------------------------------------------------



FAIL: Some of the unit tests failed. Please check the relevant logs.

Reviews applied: `['67270']`

Failed command: `Start-MesosCITesting`

All the build artifacts available at: http://dcos-win.westus.cloudapp.azure.com/mesos-build/review/67270

Relevant logs:

- [mesos-tests-stdout.log](http://dcos-win.westus.cloudapp.azure.com/mesos-build/review/67270/logs/mesos-tests-stdout.log):

```
[       OK ] Endpoint/SlaveEndpointTest.NoAuthorizer/2 (108 ms)
[----------] 9 tests from Endpoint/SlaveEndpointTest (1020 ms total)

[----------] 2 tests from ContainerizerType/DefaultContainerDNSFlagTest
[ RUN      ] ContainerizerType/DefaultContainerDNSFlagTest.ValidateFlag/0
[       OK ] ContainerizerType/DefaultContainerDNSFlagTest.ValidateFlag/0 (34 ms)
[ RUN      ] ContainerizerType/DefaultContainerDNSFlagTest.ValidateFlag/1
[       OK ] ContainerizerType/DefaultContainerDNSFlagTest.ValidateFlag/1 (39 ms)
[----------] 2 tests from ContainerizerType/DefaultContainerDNSFlagTest (74 ms total)

[----------] 1 test from IsolationFlag/CpuIsolatorTest
[ RUN      ] IsolationFlag/CpuIsolatorTest.ROOT_UserCpuUsage/0
[       OK ] IsolationFlag/CpuIsolatorTest.ROOT_UserCpuUsage/0 (733 ms)
[----------] 1 test from IsolationFlag/CpuIsolatorTest (757 ms total)

[----------] 1 test from IsolationFlag/MemoryIsolatorTest
[ RUN      ] IsolationFlag/MemoryIsolatorTest.ROOT_MemUsage/0
[       OK ] IsolationFlag/MemoryIsolatorTest.ROOT_MemUsage/0 (734 ms)
[----------] 1 test from IsolationFlag/MemoryIsolatorTest (759 ms total)

[----------] Global test environment tear-down
[==========] 981 tests from 95 test cases ran. (435037 ms total)
[  PASSED  ] 980 tests.
[  FAILED  ] 1 test, listed below:
[  FAILED  ] DockerContainerizerHealthCheckTest.ROOT_DOCKER_DockerHealthStatusChange

 1 FAILED TEST
  YOU HAVE 220 DISABLED TESTS

```

- [mesos-tests-stderr.log](http://dcos-win.westus.cloudapp.azure.com/mesos-build/review/67270/logs/mesos-tests-stderr.log):

```
I0523 18:11:27.748963 17504 master.cpp:10843] Updating the state of task e178d70f-75a2-48db-b330-3002e02c0a6a
of framework 844dba26-cc78-4504-8f69-ae4460431ad1-0000 (latest state: TASK_KILLED, status
update state: TASK_KILLED)
I0523 18:11:27.748963 18024 slave.cpp:3935] Shutting down framework 844dba26-cc78-4504-8f69-ae4460431ad1-0000
I0523 18:11:27.748963 18024 slave.cpp:I0523 18:11:27.580924 19980 exec.cpp:162] Version: 1.7.0
I0523 18:11:27.605945 17444 exec.cpp:236] Executor registered on agent 844dba26-cc78-4504-8f69-ae4460431ad1-S0
I0523 18:11:27.609900 19960 executor.cpp:178] Received SUBSCRIBED event
I0523 18:11:27.615002 19960 executor.cpp:182] Subscribed executor on windows-02.enofukwu14ruplxn0gs3yzmsgf.xx.internal.cloudapp.net
I0523 18:11:27.615002 19960 executor.cpp:178] Received LAUNCH event
I0523 18:11:27.619940 19960 executor.cpp:665] Starting task e178d70f-75a2-48db-b330-3002e02c0a6a
I0523 18:11:27.704953 19960 executor.cpp:485] Running 'D:\DCOS\mesos\src\mesos-containerizer.exe
launch <POSSIBLY-SENSITIVE-DATA>'
I0523 18:11:27.721946 19960 executor.cpp:678] Forked command at 12296
I0523 18:11:27.750887 16904 exec.cpp:445] Executor asked to shutdown
I0523 18:11:27.751888 20004 executor.cpp:178] Received SHUTDOWN event
I0523 18:11:27.751888 20004 executor.cpp:781] Shutting down
I0523 18:11:27.751888 20004 executor.cpp:894] Sending SIGTERM to process tree at pid 126656]
Shutting down executor 'e178d70f-75a2-48db-b330-3002e02c0a6a' of framework 844dba26-cc78-4504-8f69-ae4460431ad1-0000
at executor(1)@192.10.1.6:58349
I0523 18:11:27.750887 18024 slave.cpp:929] Agent terminating
I0523 18:11:27.750887 17504 master.cpp:10942] Removing task e178d70f-75a2-48db-b330-3002e02c0a6a
with resources cpus(allocated: *):4; mem(allocated: *):2048; disk(allocated: *):1024; ports(allocated:
*):[31000-32000] of framework 844dba26-cc78-4504-8f69-ae4460431ad1-0000 on agent 844dba26-cc78-4504-8f69-ae4460431ad1-S0
at slave(448)@192.10.1.6:58328 (windows-02.enofukwu14ruplxn0gs3yzmsgf.xx.internal.cloudapp.net)
W0523 18:11:27.751888 18024 slave.cpp:3931] Ignoring shutdown framework 844dba26-cc78-4504-8f69-ae4460431ad1-0000
because it is terminating
I0523 18:11:27.753922  7960 master.cpp:1293] Agent 844dba26-cc78-4504-8f69-ae4460431ad1-S0
at slave(448)@192.10.1.6:58328 (windows-02.enofukwu14ruplxn0gs3yzmsgf.xx.internal.cloudapp.net)
disconnected
I0523 18:11:27.753922  7960 master.cpp:3303] Disconnecting agent 844dba26-cc78-4504-8f69-ae4460431ad1-S0
at slave(448)@192.10.1.6:58328 (windows-02.enofukwu14ruplxn0gs3yzmsgf.xx.internal.cloudapp.net)
I0523 18:11:27.754933 12548 hierarchical.cpp:344] Removed framework 844dba26-cc78-4504-8f69-ae4460431ad1-0000
I0523 18:11:27.754933  7960 master.cpp:3322] Deactivating agent 844dba26-cc78-4504-8f69-ae4460431ad1-S0
at slave(448)@192.10.1.6:58328 (windows-02.enofukwu14ruplxn0gs3yzmsgf.xx.internal.cloudapp.net)
I0523 18:11:27.755892 11528 hierarchical.cpp:766] Agent 844dba26-cc78-4504-8f69-ae4460431ad1-S0
deactivated
I0523 18:11:27.755892 11932 containerizer.cpp:2382] Destroying container 5e7e1444-250d-450e-a923-6fc5d506dba4
in RUNNING state
I0523 18:11:27.755892 11932 containerizer.cpp:2996] Transitioning the state of container 5e7e1444-250d-450e-a923-6fc5d506dba4
from RUNNING to DESTROYING
I0523 18:11:27.756932 11932 launcher.cpp:156] Asked to destroy container 5e7e1444-250d-450e-a923-6fc5d506dba4
I0523 18:11:27.820080 18912 containerizer.cpp:2835] Container 5e7e1444-250d-450e-a923-6fc5d506dba4
has exited
I0523 18:11:27.850078 18452 master.cpp:1135] Master terminating
I0523 18:11:27.853080  7960 hierarchical.cpp:609] Removed agent 844dba26-cc78-4504-8f69-ae4460431ad1-S0
I0523 18:11:28.256083 10320 process.cpp:940] Stopped the socket accept loop
```

- Mesos Reviewbot Windows


On May 23, 2018, 5:22 p.m., Benno Evers wrote:
> 
> -----------------------------------------------------------
> This is an automatically generated e-mail. To reply, visit:
> https://reviews.apache.org/r/67270/
> -----------------------------------------------------------
> 
> (Updated May 23, 2018, 5:22 p.m.)
> 
> 
> Review request for mesos and Benjamin Mahler.
> 
> 
> Repository: mesos
> 
> 
> Description
> -------
> 
> The 'example.cpp' file in libprocess was missing the mandatory
> help string argument.
> 
> 
> Diffs
> -----
> 
>   3rdparty/libprocess/examples/example.cpp a97665ee6b75c5b31397b5a10002fa23a7fe370a 
> 
> 
> Diff: https://reviews.apache.org/r/67270/diff/1/
> 
> 
> Testing
> -------
> 
> Compiled the `example.cpp` file.
> 
> 
> Thanks,
> 
> Benno Evers
> 
>


Mime
  • Unnamed multipart/alternative (inline, None, 0 bytes)
View raw message