mesos-reviews mailing list archives

Site index · List index
Message view « Date » · « Thread »
Top « Date » · « Thread »
From Mesos Reviewbot Windows <revi...@mesos.apache.org>
Subject Re: Review Request 66883: Added/updated tests to check per framework metrics.
Date Mon, 14 May 2018 19:01:19 GMT

-----------------------------------------------------------
This is an automatically generated e-mail. To reply, visit:
https://reviews.apache.org/r/66883/#review203057
-----------------------------------------------------------



FAIL: Some of the unit tests failed. Please check the relevant logs.

Reviews applied: `['66882', '66819', '66820', '66822', '66823', '66845', '66825', '66846',
'66847', '66841', '66842', '66843', '66844', '66855', '66861', '66856', '66870', '66874',
'67043', '66883']`

Failed command: `Start-MesosCITesting`

All the build artifacts available at: http://dcos-win.westus.cloudapp.azure.com/mesos-build/review/66883

Relevant logs:

- [libprocess-tests-cmake-stdout.log](http://dcos-win.westus.cloudapp.azure.com/mesos-build/review/66883/logs/libprocess-tests-cmake-stdout.log):

```
         d:\dcos\mesos\3rdparty\libevent-2.1.5-beta\src\libevent-2.1.5-beta\bufferevent_openssl.c(1275):
warning C4244: 'function': conversion from 'intptr_t' to 'int', possible loss of data [D:\DCOS\mesos\3rdparty\libevent-2.1.5-beta\src\libevent-2.1.5-beta-build\event_core.vcxproj]
[D:\DCOS\mesos\3rdparty\libevent-2.1.5-beta.vcxproj]
         d:\dcos\mesos\3rdparty\libevent-2.1.5-beta\src\libevent-2.1.5-beta\bufferevent_openssl.c(1456):
warning C4244: 'function': conversion from 'intptr_t' to 'int', possible loss of data [D:\DCOS\mesos\3rdparty\libevent-2.1.5-beta\src\libevent-2.1.5-beta-build\event_core.vcxproj]
[D:\DCOS\mesos\3rdparty\libevent-2.1.5-beta.vcxproj]
         d:\dcos\mesos\3rdparty\libevent-2.1.5-beta\src\libevent-2.1.5-beta\buffer.c(3099):
warning C4244: 'function': conversion from 'int64_t' to 'unsigned int', possible loss of data
[D:\DCOS\mesos\3rdparty\libevent-2.1.5-beta\src\libevent-2.1.5-beta-build\event_extra.vcxproj]
[D:\DCOS\mesos\3rdparty\libevent-2.1.5-beta.vcxproj]
         d:\dcos\mesos\3rdparty\libevent-2.1.5-beta\src\libevent-2.1.5-beta\evutil_time.c(499):
warning C4244: '=': conversion from 'int64_t' to 'long', possible loss of data [D:\DCOS\mesos\3rdparty\libevent-2.1.5-beta\src\libevent-2.1.5-beta-build\event_extra.vcxproj]
[D:\DCOS\mesos\3rdparty\libevent-2.1.5-beta.vcxproj]
         d:\dcos\mesos\3rdparty\libevent-2.1.5-beta\src\libevent-2.1.5-beta\evutil_time.c(504):
warning C4244: '=': conversion from 'time_t' to 'long', possible loss of data [D:\DCOS\mesos\3rdparty\libevent-2.1.5-beta\src\libevent-2.1.5-beta-build\event_extra.vcxproj]
[D:\DCOS\mesos\3rdparty\libevent-2.1.5-beta.vcxproj]
         d:\dcos\mesos\3rdparty\libevent-2.1.5-beta\src\libevent-2.1.5-beta\bufferevent_openssl.c(185):
warning C4267: '=': conversion from 'size_t' to 'int', possible loss of data [D:\DCOS\mesos\3rdparty\libevent-2.1.5-beta\src\libevent-2.1.5-beta-build\event_extra.vcxproj]
[D:\DCOS\mesos\3rdparty\libevent-2.1.5-beta.vcxproj]
         d:\dcos\mesos\3rdparty\libevent-2.1.5-beta\src\libevent-2.1.5-beta\bufferevent_openssl.c(230):
warning C4267: 'function': conversion from 'size_t' to 'int', possible loss of data [D:\DCOS\mesos\3rdparty\libevent-2.1.5-beta\src\libevent-2.1.5-beta-build\event_extra.vcxproj]
[D:\DCOS\mesos\3rdparty\libevent-2.1.5-beta.vcxproj]
         d:\dcos\mesos\3rdparty\libevent-2.1.5-beta\src\libevent-2.1.5-beta\bufferevent_openssl.c(587):
warning C4244: '=': conversion from 'SSIZE_T' to 'int', possible loss of data [D:\DCOS\mesos\3rdparty\libevent-2.1.5-beta\src\libevent-2.1.5-beta-build\event_extra.vcxproj]
[D:\DCOS\mesos\3rdparty\libevent-2.1.5-beta.vcxproj]
         d:\dcos\mesos\3rdparty\libevent-2.1.5-beta\src\libevent-2.1.5-beta\bufferevent_openssl.c(598):
warning C4267: 'function': conversion from 'size_t' to 'int', possible loss of data [D:\DCOS\mesos\3rdparty\libevent-2.1.5-beta\src\libevent-2.1.5-beta-build\event_extra.vcxproj]
[D:\DCOS\mesos\3rdparty\libevent-2.1.5-beta.vcxproj]
         d:\dcos\mesos\3rdparty\libevent-2.1.5-beta\src\libevent-2.1.5-beta\bufferevent_openssl.c(654):
warning C4244: '=': conversion from 'SSIZE_T' to 'int', possible loss of data [D:\DCOS\mesos\3rdparty\libevent-2.1.5-beta\src\libevent-2.1.5-beta-build\event_extra.vcxproj]
[D:\DCOS\mesos\3rdparty\libevent-2.1.5-beta.vcxproj]
         d:\dcos\mesos\3rdparty\libevent-2.1.5-beta\src\libevent-2.1.5-beta\bufferevent_openssl.c(656):
warning C4244: '=': conversion from 'SSIZE_T' to 'int', possible loss of data [D:\DCOS\mesos\3rdparty\libevent-2.1.5-beta\src\libevent-2.1.5-beta-build\event_extra.vcxproj]
[D:\DCOS\mesos\3rdparty\libevent-2.1.5-beta.vcxproj]
         d:\dcos\mesos\3rdparty\libevent-2.1.5-beta\src\libevent-2.1.5-beta\bufferevent_openssl.c(675):
warning C4267: 'function': conversion from 'size_t' to 'int', possible loss of data [D:\DCOS\mesos\3rdparty\libevent-2.1.5-beta\src\libevent-2.1.5-beta-build\event_extra.vcxproj]
[D:\DCOS\mesos\3rdparty\libevent-2.1.5-beta.vcxproj]
         d:\dcos\mesos\3rdparty\libevent-2.1.5-beta\src\libevent-2.1.5-beta\bufferevent_openssl.c(755):
warning C4267: '=': conversion from 'size_t' to 'int', possible loss of data [D:\DCOS\mesos\3rdparty\libevent-2.1.5-beta\src\libevent-2.1.5-beta-build\event_extra.vcxproj]
[D:\DCOS\mesos\3rdparty\libevent-2.1.5-beta.vcxproj]
         d:\dcos\mesos\3rdparty\libevent-2.1.5-beta\src\libevent-2.1.5-beta\bufferevent_openssl.c(763):
warning C4244: '=': conversion from 'SSIZE_T' to 'int', possible loss of data [D:\DCOS\mesos\3rdparty\libevent-2.1.5-beta\src\libevent-2.1.5-beta-build\event_extra.vcxproj]
[D:\DCOS\mesos\3rdparty\libevent-2.1.5-beta.vcxproj]
         d:\dcos\mesos\3rdparty\libevent-2.1.5-beta\src\libevent-2.1.5-beta\bufferevent_openssl.c(874):
warning C4267: '=': conversion from 'size_t' to 'int', possible loss of data [D:\DCOS\mesos\3rdparty\libevent-2.1.5-beta\src\libevent-2.1.5-beta-build\event_extra.vcxproj]
[D:\DCOS\mesos\3rdparty\libevent-2.1.5-beta.vcxproj]
         d:\dcos\mesos\3rdparty\libevent-2.1.5-beta\src\libevent-2.1.5-beta\bufferevent_openssl.c(1275):
warning C4244: 'function': conversion from 'intptr_t' to 'int', possible loss of data [D:\DCOS\mesos\3rdparty\libevent-2.1.5-beta\src\libevent-2.1.5-beta-build\event_extra.vcxproj]
[D:\DCOS\mesos\3rdparty\libevent-2.1.5-beta.vcxproj]
         d:\dcos\mesos\3rdparty\libevent-2.1.5-beta\src\libevent-2.1.5-beta\bufferevent_openssl.c(1456):
warning C4244: 'function': conversion from 'intptr_t' to 'int', possible loss of data [D:\DCOS\mesos\3rdparty\libevent-2.1.5-beta\src\libevent-2.1.5-beta-build\event_extra.vcxproj]
[D:\DCOS\mesos\3rdparty\libevent-2.1.5-beta.vcxproj]
         d:\dcos\mesos\3rdparty\libevent-2.1.5-beta\src\libevent-2.1.5-beta\evdns.c(3792):
warning C4996: 'GetVersion': was declared deprecated [D:\DCOS\mesos\3rdparty\libevent-2.1.5-beta\src\libevent-2.1.5-beta-build\event_extra.vcxproj]
[D:\DCOS\mesos\3rdparty\libevent-2.1.5-beta.vcxproj]


       "D:\DCOS\mesos\3rdparty\libprocess\src\tests\libprocess-tests.vcxproj" (default target)
(1) ->
       "D:\DCOS\mesos\3rdparty\libprocess\src\tests\benchmarks.vcxproj" (default target) (11)
->
       (ClCompile target) -> 
         d:\dcos\mesos\mesos\3rdparty\libprocess\src\tests\benchmarks.cpp(566): error C2276:
'&': illegal operation on bound member function expression [D:\DCOS\mesos\3rdparty\libprocess\src\tests\benchmarks.vcxproj]

    112 Warning(s)
    1 Error(s)

Time Elapsed 00:04:55.11
```

- [mesos-tests-cmake-stdout.log](http://dcos-win.westus.cloudapp.azure.com/mesos-build/review/66883/logs/mesos-tests-cmake-stdout.log):

```
         d:\dcos\mesos\mesos\src\master\metrics.hpp(230): error C2653: 'scheduler': is not
a class or namespace name [D:\DCOS\mesos\src\mesos.vcxproj]
         d:\dcos\mesos\mesos\src\master\metrics.hpp(230): error C4430: missing type specifier
- int assumed. Note: C++ does not support default-int [D:\DCOS\mesos\src\mesos.vcxproj]
         d:\dcos\mesos\mesos\src\master\metrics.hpp(230): error C2143: syntax error: missing
',' before '&' [D:\DCOS\mesos\src\mesos.vcxproj]
         d:\dcos\mesos\mesos\src\master\metrics.hpp(232): error C2653: 'scheduler': is not
a class or namespace name [D:\DCOS\mesos\src\mesos.vcxproj]
         d:\dcos\mesos\mesos\src\master\metrics.hpp(232): error C4430: missing type specifier
- int assumed. Note: C++ does not support default-int [D:\DCOS\mesos\src\mesos.vcxproj]
         d:\dcos\mesos\mesos\src\master\metrics.hpp(232): error C2143: syntax error: missing
',' before '&' [D:\DCOS\mesos\src\mesos.vcxproj]
         d:\dcos\mesos\mesos\src\master\metrics.hpp(252): error C2653: 'scheduler': is not
a class or namespace name [D:\DCOS\mesos\src\mesos.vcxproj]
         d:\dcos\mesos\mesos\src\master\metrics.hpp(252): error C2065: 'Type': undeclared
identifier [D:\DCOS\mesos\src\mesos.vcxproj]
         d:\dcos\mesos\mesos\src\master\metrics.hpp(252): error C2923: 'hashmap': 'Type' is
not a valid template type argument for parameter 'Key' [D:\DCOS\mesos\src\mesos.vcxproj]
         d:\dcos\mesos\mesos\3rdparty\stout\include\stout\hashmap.hpp(33): error C2903: 'is_enum':
symbol is neither a class template nor a function template [D:\DCOS\mesos\src\mesos.vcxproj]
         d:\dcos\mesos\mesos\3rdparty\stout\include\stout\hashmap.hpp(34): error C2039: 'value':
is not a member of 'std' [D:\DCOS\mesos\src\mesos.vcxproj]
         d:\dcos\mesos\mesos\3rdparty\stout\include\stout\hashmap.hpp(36): error C2903: 'hash':
symbol is neither a class template nor a function template [D:\DCOS\mesos\src\mesos.vcxproj]
         d:\dcos\mesos\mesos\3rdparty\stout\include\stout\hashmap.hpp(36): error C2993: 'unknown-type':
illegal type for non-type template parameter '_Test' [D:\DCOS\mesos\src\mesos.vcxproj]
         d:\dcos\mesos\mesos\src\master\metrics.hpp(252): error C2903: 'conditional': symbol
is neither a class template nor a function template [D:\DCOS\mesos\src\mesos.vcxproj]
         d:\dcos\mesos\mesos\src\master\metrics.hpp(252): error C2062: type 'unknown-type'
unexpected [D:\DCOS\mesos\src\mesos.vcxproj]
         d:\dcos\mesos\mesos\src\master\metrics.hpp(252): error C2903: 'equal_to': symbol
is neither a class template nor a function template [D:\DCOS\mesos\src\mesos.vcxproj]
         d:\dcos\mesos\mesos\src\master\metrics.hpp(252): error C2976: 'hashmap': too few
template arguments [D:\DCOS\mesos\src\mesos.vcxproj]
         d:\dcos\mesos\mesos\src\master\metrics.hpp(255): error C2653: 'scheduler': is not
a class or namespace name [D:\DCOS\mesos\src\mesos.vcxproj]
         d:\dcos\mesos\mesos\src\master\metrics.hpp(255): error C2065: 'Type': undeclared
identifier [D:\DCOS\mesos\src\mesos.vcxproj]
         d:\dcos\mesos\mesos\src\master\metrics.hpp(255): error C2923: 'hashmap': 'Type' is
not a valid template type argument for parameter 'Key' [D:\DCOS\mesos\src\mesos.vcxproj]
         d:\dcos\mesos\mesos\src\master\metrics.hpp(255): error C2903: 'conditional': symbol
is neither a class template nor a function template [D:\DCOS\mesos\src\mesos.vcxproj]
         d:\dcos\mesos\mesos\src\master\metrics.hpp(255): error C2062: type 'unknown-type'
unexpected [D:\DCOS\mesos\src\mesos.vcxproj]
         d:\dcos\mesos\mesos\src\master\metrics.hpp(255): error C2903: 'equal_to': symbol
is neither a class template nor a function template [D:\DCOS\mesos\src\mesos.vcxproj]
         d:\dcos\mesos\mesos\src\master\metrics.hpp(255): error C2976: 'hashmap': too few
template arguments [D:\DCOS\mesos\src\mesos.vcxproj]

    172 Warning(s)
    27 Error(s)

Time Elapsed 00:15:02.77
```

- Mesos Reviewbot Windows


On May 14, 2018, 5:19 p.m., Gaston Kleiman wrote:
> 
> -----------------------------------------------------------
> This is an automatically generated e-mail. To reply, visit:
> https://reviews.apache.org/r/66883/
> -----------------------------------------------------------
> 
> (Updated May 14, 2018, 5:19 p.m.)
> 
> 
> Review request for Benjamin Mahler, Gilbert Song, Greg Mann, and Vinod Kone.
> 
> 
> Repository: mesos
> 
> 
> Description
> -------
> 
> Added/updated tests to check per framework metrics.
> 
> 
> Diffs
> -----
> 
>   src/tests/master_tests.cpp d5ce52c0eb1ba333d1b3dd35518545c13d828ce6 
> 
> 
> Diff: https://reviews.apache.org/r/66883/diff/1/
> 
> 
> Testing
> -------
> 
> 
> Thanks,
> 
> Gaston Kleiman
> 
>


Mime
  • Unnamed multipart/alternative (inline, None, 0 bytes)
View raw message