mesos-reviews mailing list archives

Site index · List index
Message view « Date » · « Thread »
Top « Date » · « Thread »
From Mesos Reviewbot Windows <revi...@mesos.apache.org>
Subject Re: Review Request 67043: Made the master task state metrics track reregistered agents' tasks.
Date Thu, 10 May 2018 00:23:20 GMT

-----------------------------------------------------------
This is an automatically generated e-mail. To reply, visit:
https://reviews.apache.org/r/67043/#review202809
-----------------------------------------------------------



FAIL: Some of the unit tests failed. Please check the relevant logs.

Reviews applied: `['66819', '66820', '66821', '66822', '66823', '66845', '66824', '66825',
'66846', '66847', '66841', '66842', '66843', '66844', '66855', '66861', '66856', '66870',
'66874', '67043']`

Failed command: `Start-MesosCITesting`

All the build artifacts available at: http://dcos-win.westus.cloudapp.azure.com/mesos-build/review/67043

Relevant logs:

- [mesos-tests-cmake-stdout.log](http://dcos-win.westus.cloudapp.azure.com/mesos-build/review/67043/logs/mesos-tests-cmake-stdout.log):

```
         d:\dcos\mesos\3rdparty\zookeeper-3.4.8\src\zookeeper-3.4.8\src\c\src\winport.c(256):
warning C4090: 'function': different 'const' qualifiers [D:\DCOS\mesos\3rdparty\zookeeper-3.4.8\src\zookeeper-3.4.8-build\zookeeper.vcxproj]
[D:\DCOS\mesos\3rdparty\zookeeper-3.4.8.vcxproj]
         d:\dcos\mesos\3rdparty\zookeeper-3.4.8\src\zookeeper-3.4.8\src\c\src\winport.c(166):
warning C4716: 'pthread_cond_broadcast': must return a value [D:\DCOS\mesos\3rdparty\zookeeper-3.4.8\src\zookeeper-3.4.8-build\zookeeper.vcxproj]
[D:\DCOS\mesos\3rdparty\zookeeper-3.4.8.vcxproj]
         d:\dcos\mesos\3rdparty\zookeeper-3.4.8\src\zookeeper-3.4.8\src\c\src\winport.c(205):
warning C4716: 'pthread_cond_wait': must return a value [D:\DCOS\mesos\3rdparty\zookeeper-3.4.8\src\zookeeper-3.4.8-build\zookeeper.vcxproj]
[D:\DCOS\mesos\3rdparty\zookeeper-3.4.8.vcxproj]
         d:\dcos\mesos\3rdparty\zookeeper-3.4.8\src\zookeeper-3.4.8\src\c\src\cli.c(124):
warning C4996: 'fopen': This function or variable may be unsafe. Consider using fopen_s instead.
To disable deprecation, use _CRT_SECURE_NO_WARNINGS. See online help for details. [D:\DCOS\mesos\3rdparty\zookeeper-3.4.8\src\zookeeper-3.4.8-build\cli.vcxproj]
[D:\DCOS\mesos\3rdparty\zookeeper-3.4.8.vcxproj]
         d:\dcos\mesos\3rdparty\zookeeper-3.4.8\src\zookeeper-3.4.8\src\c\src\cli.c(128):
warning C4267: 'initializing': conversion from 'size_t' to 'int', possible loss of data [D:\DCOS\mesos\3rdparty\zookeeper-3.4.8\src\zookeeper-3.4.8-build\cli.vcxproj]
[D:\DCOS\mesos\3rdparty\zookeeper-3.4.8.vcxproj]
         d:\dcos\mesos\3rdparty\zookeeper-3.4.8\src\zookeeper-3.4.8\src\c\src\cli.c(279):
warning C4267: 'function': conversion from 'size_t' to 'int', possible loss of data [D:\DCOS\mesos\3rdparty\zookeeper-3.4.8\src\zookeeper-3.4.8-build\cli.vcxproj]
[D:\DCOS\mesos\3rdparty\zookeeper-3.4.8.vcxproj]
         d:\dcos\mesos\3rdparty\zookeeper-3.4.8\src\zookeeper-3.4.8\src\c\src\cli.c(301):
warning C4267: 'initializing': conversion from 'size_t' to 'int', possible loss of data [D:\DCOS\mesos\3rdparty\zookeeper-3.4.8\src\zookeeper-3.4.8-build\cli.vcxproj]
[D:\DCOS\mesos\3rdparty\zookeeper-3.4.8.vcxproj]
         d:\dcos\mesos\3rdparty\zookeeper-3.4.8\src\zookeeper-3.4.8\src\c\src\cli.c(368):
warning C4267: 'function': conversion from 'size_t' to 'int', possible loss of data [D:\DCOS\mesos\3rdparty\zookeeper-3.4.8\src\zookeeper-3.4.8-build\cli.vcxproj]
[D:\DCOS\mesos\3rdparty\zookeeper-3.4.8.vcxproj]
         d:\dcos\mesos\3rdparty\zookeeper-3.4.8\src\zookeeper-3.4.8\src\c\src\cli.c(372):
warning C4267: 'function': conversion from 'size_t' to 'int', possible loss of data [D:\DCOS\mesos\3rdparty\zookeeper-3.4.8\src\zookeeper-3.4.8-build\cli.vcxproj]
[D:\DCOS\mesos\3rdparty\zookeeper-3.4.8.vcxproj]
         d:\dcos\mesos\3rdparty\zookeeper-3.4.8\src\zookeeper-3.4.8\src\c\src\cli.c(512):
warning C4267: 'function': conversion from 'size_t' to 'int', possible loss of data [D:\DCOS\mesos\3rdparty\zookeeper-3.4.8\src\zookeeper-3.4.8-build\cli.vcxproj]
[D:\DCOS\mesos\3rdparty\zookeeper-3.4.8.vcxproj]
         d:\dcos\mesos\3rdparty\zookeeper-3.4.8\src\zookeeper-3.4.8\src\c\src\cli.c(543):
warning C4996: 'strcpy': This function or variable may be unsafe. Consider using strcpy_s
instead. To disable deprecation, use _CRT_SECURE_NO_WARNINGS. See online help for details.
[D:\DCOS\mesos\3rdparty\zookeeper-3.4.8\src\zookeeper-3.4.8-build\cli.vcxproj] [D:\DCOS\mesos\3rdparty\zookeeper-3.4.8.vcxproj]
         d:\dcos\mesos\3rdparty\zookeeper-3.4.8\src\zookeeper-3.4.8\src\c\src\cli.c(548):
warning C4996: 'fopen': This function or variable may be unsafe. Consider using fopen_s instead.
To disable deprecation, use _CRT_SECURE_NO_WARNINGS. See online help for details. [D:\DCOS\mesos\3rdparty\zookeeper-3.4.8\src\zookeeper-3.4.8-build\cli.vcxproj]
[D:\DCOS\mesos\3rdparty\zookeeper-3.4.8.vcxproj]
         d:\dcos\mesos\3rdparty\zookeeper-3.4.8\src\zookeeper-3.4.8\src\c\src\cli.c(569):
warning C4996: 'strcpy': This function or variable may be unsafe. Consider using strcpy_s
instead. To disable deprecation, use _CRT_SECURE_NO_WARNINGS. See online help for details.
[D:\DCOS\mesos\3rdparty\zookeeper-3.4.8\src\zookeeper-3.4.8-build\cli.vcxproj] [D:\DCOS\mesos\3rdparty\zookeeper-3.4.8.vcxproj]


       "D:\DCOS\mesos\src\tests\mesos-tests.vcxproj" (default target) (1) ->
       "D:\DCOS\mesos\src\mesos.vcxproj" (default target) (25) ->
       (ClCompile target) -> 
         d:\dcos\mesos\mesos\src\master\metrics.cpp(798): error C3861: 'getFrameworkMetricPrefix':
identifier not found [D:\DCOS\mesos\src\mesos.vcxproj]
         d:\dcos\mesos\mesos\src\master\metrics.cpp(799): error C2512: 'process::metrics::PushGauge':
no appropriate default constructor available [D:\DCOS\mesos\src\mesos.vcxproj]
         d:\dcos\mesos\mesos\src\master\metrics.cpp(797): error C2512: 'process::metrics::PushGauge':
no appropriate default constructor available [D:\DCOS\mesos\src\mesos.vcxproj]
         d:\dcos\mesos\mesos\src\master\metrics.cpp(813): error C3861: 'getFrameworkMetricPrefix':
identifier not found [D:\DCOS\mesos\src\mesos.vcxproj]
         d:\dcos\mesos\mesos\src\master\metrics.cpp(814): error C2512: 'process::metrics::PushGauge':
no appropriate default constructor available [D:\DCOS\mesos\src\mesos.vcxproj]
         d:\dcos\mesos\mesos\src\master\metrics.cpp(812): error C2512: 'process::metrics::PushGauge':
no appropriate default constructor available [D:\DCOS\mesos\src\mesos.vcxproj]

    172 Warning(s)
    6 Error(s)

Time Elapsed 00:16:43.31
```

- Mesos Reviewbot Windows


On May 9, 2018, 11:47 p.m., Greg Mann wrote:
> 
> -----------------------------------------------------------
> This is an automatically generated e-mail. To reply, visit:
> https://reviews.apache.org/r/67043/
> -----------------------------------------------------------
> 
> (Updated May 9, 2018, 11:47 p.m.)
> 
> 
> Review request for mesos, Benjamin Mahler, Gaston Kleiman, Gilbert Song, and Vinod Kone.
> 
> 
> Repository: mesos
> 
> 
> Description
> -------
> 
> Made the master task state metrics track reregistered agents' tasks.
> 
> 
> Diffs
> -----
> 
>   src/master/master.cpp 41862db9900acde85a62d2fea85459691c68556e 
>   src/master/metrics.hpp ec76dbcd1d1fa5349d62ce73fb9603e1986a776b 
>   src/master/metrics.cpp e46ead79f3f29e285426f9d061337077f453aa45 
> 
> 
> Diff: https://reviews.apache.org/r/67043/diff/1/
> 
> 
> Testing
> -------
> 
> 
> Thanks,
> 
> Greg Mann
> 
>


Mime
  • Unnamed multipart/alternative (inline, None, 0 bytes)
View raw message