mesos-reviews mailing list archives

Site index · List index
Message view « Date » · « Thread »
Top « Date » · « Thread »
From Mesos Reviewbot Windows <revi...@mesos.apache.org>
Subject Re: Review Request 66984: WIP: exhaustively allocate declined resources.
Date Mon, 07 May 2018 08:27:46 GMT

-----------------------------------------------------------
This is an automatically generated e-mail. To reply, visit:
https://reviews.apache.org/r/66984/#review202539
-----------------------------------------------------------



FAIL: Some of the unit tests failed. Please check the relevant logs.

Reviews applied: `['66981', '66982', '66983', '66984']`

Failed command: `Start-MesosCITesting`

All the build artifacts available at: http://dcos-win.westus.cloudapp.azure.com/mesos-build/review/66984

Relevant logs:

- [mesos-tests-stdout.log](http://dcos-win.westus.cloudapp.azure.com/mesos-build/review/66984/logs/mesos-tests-stdout.log):

```
[ RUN      ] ContainerizerType/DefaultContainerDNSFlagTest.ValidateFlag/0
[       OK ] ContainerizerType/DefaultContainerDNSFlagTest.ValidateFlag/0 (37 ms)
[ RUN      ] ContainerizerType/DefaultContainerDNSFlagTest.ValidateFlag/1
[       OK ] ContainerizerType/DefaultContainerDNSFlagTest.ValidateFlag/1 (38 ms)
[----------] 2 tests from ContainerizerType/DefaultContainerDNSFlagTest (77 ms total)

[----------] 1 test from IsolationFlag/CpuIsolatorTest
[ RUN      ] IsolationFlag/CpuIsolatorTest.ROOT_UserCpuUsage/0
[       OK ] IsolationFlag/CpuIsolatorTest.ROOT_UserCpuUsage/0 (795 ms)
[----------] 1 test from IsolationFlag/CpuIsolatorTest (818 ms total)

[----------] 1 test from IsolationFlag/MemoryIsolatorTest
[ RUN      ] IsolationFlag/MemoryIsolatorTest.ROOT_MemUsage/0
[       OK ] IsolationFlag/MemoryIsolatorTest.ROOT_MemUsage/0 (838 ms)
[----------] 1 test from IsolationFlag/MemoryIsolatorTest (864 ms total)

[----------] Global test environment tear-down
d:\dcos\mesos\mesos\src\tests\environment.cpp(950): error: Failed
Tests completed with child processes remaining:
-+- 18744 000000DB9D77E4EC
 --- 13588 000000DB9D77E4EC
[==========] 978 tests from 95 test cases ran. (468312 ms total)
[  PASSED  ] 977 tests.
[  FAILED  ] 1 test, listed below:
[  FAILED  ] MesosContainerizer/DefaultExecutorTest.SigkillExecutor/0, where GetParam() =
"mesos"

 1 FAILED TEST
  YOU HAVE 219 DISABLED TESTS

```

- [mesos-tests-stderr.log](http://dcos-win.westus.cloudapp.azure.com/mesos-build/review/66984/logs/mesos-tests-stderr.log):

```
I0507 08:27:32.375484  2160 master.cpp:10824] Updating the state of task 77859b0b-5d59-4455-90be-a3922000bc5e
of framework 3b1ef1d4-c2b8-4f24-b9f3-ab38c76a3626-0000 (latest state: TASK_KILLED, status
update state: TASK_KILLED)
I0507 08:27:32.375484 17484 slave.cpp:3935] Shutting down framework 3b1ef1d4-c2b8-4f24-b9f3-ab38c76a3626-0000
I0507 08:27:32.376667 17484 slave.cpp:6656] Shutting down executor '77859b0b-5d59-4455-90be-a3922000bc5e'
of framework 3b1ef1d4-c2b8-4f24-b9f3-ab38c76a3626-0000 at execuI0507 08:27:32.199512 14312
exec.cpp:162] Version: 1.6.0
I0507 08:27:32.233479 13004 exec.cpp:236] Executor registered on agent 3b1ef1d4-c2b8-4f24-b9f3-ab38c76a3626-S0
I0507 08:27:32.237509 17980 executor.cpp:178] Received SUBSCRIBED event
I0507 08:27:32.242509 17980 executor.cpp:182] Subscribed executor on winbldsrv-01.zq4gs31qjdiunm1ryi1452nvnh.dx.internal.cloudapp.net
I0507 08:27:32.242509 17980 executor.cpp:178] Received LAUNCH event
I0507 08:27:32.248509 17980 executor.cpp:665] Starting task 77859b0b-5d59-4455-90be-a3922000bc5e
I0507 08:27:32.333478 17980 executor.cpp:485] Running 'D:\DCOS\mesos\src\mesos-containerizer.exe
launch <POSSIBLY-SENSITIVE-DATA>'
I0507 08:27:32.346488 17980 executor.cpp:678] Forked command at 16748
I0507 08:27:32.378477 17748 exec.cpp:445] Executor asked to shutdown
I0507 08:27:32.379479 17140 executor.cpp:178] Received SHUTDOWN event
I0507 08:27:32.379479 17140 executor.cpp:781] Shutting down
I0507 08:27:32.379479 17140 executor.cpp:894] Sending SIGTERM to process tree at pid tor(1)@10.3.1.8:61294
I0507 08:27:32.378477  2160 master.cpp:10923] Removing task 77859b0b-5d59-4455-90be-a3922000bc5e
with resources cpus(allocated: *):4; mem(allocated: *):2048; disk(allocated: *):1024; ports(allocated:
*):[31000-32000] of framework 3b1ef1d4-c2b8-4f24-b9f3-ab38c76a3626-0000 on agent 3b1ef1d4-c2b8-4f24-b9f3-ab38c76a3626-S0
at slave(443)@10.3.1.8:61273 (winbldsrv-01.zq4gs31qjdiunm1ryi1452nvnh.dx.internal.cloudapp.net)
I0507 08:27:32.378477 17484 slave.cpp:929] Agent terminating
W0507 08:27:32.378477 17484 slave.cpp:3931] Ignoring shutdown framework 3b1ef1d4-c2b8-4f24-b9f3-ab38c76a3626-0000
because it is terminating
I0507 08:27:32.381491 16084 master.cpp:1293] Agent 3b1ef1d4-c2b8-4f24-b9f3-ab38c76a3626-S0
at slave(443)@10.3.1.8:61273 (winbldsrv-01.zq4gs31qjdiunm1ryi1452nvnh.dx.internal.cloudapp.net)
disconnected
I0507 08:27:32.381491 16084 master.cpp:3299] Disconnecting agent 3b1ef1d4-c2b8-4f24-b9f3-ab38c76a3626-S0
at slave(443)@10.3.1.8:61273 (winbldsrv-01.zq4gs31qjdiunm1ryi1452nvnh.dx.internal.cloudapp.net)
I0507 08:27:32.382539  5784 hierarchical.cpp:356] Removed framework 3b1ef1d4-c2b8-4f24-b9f3-ab38c76a3626-0000
I0507 08:27:32.382539 16084 master.cpp:3318] Deactivating agent 3b1ef1d4-c2b8-4f24-b9f3-ab38c76a3626-S0
at slave(443)@10.3.1.8:61273 (winbldsrv-01.zq4gs31qjdiunm1ryi1452nvnh.dx.internal.cloudapp.net)
I0507 08:27:32.382539  5548 hierarchical.cpp:786] Agent 3b1ef1d4-c2b8-4f24-b9f3-ab38c76a3626-S0
deactivated
I0507 08:27:32.383486 17720 containerizer.cpp:2382] Destroying container 2f9bdd3f-b3cd-4b22-b67d-19b66270e066
in RUNNING state
I0507 08:27:32.383486 17720 containerizer.cpp:2996] Transitioning the state of container 2f9bdd3f-b3cd-4b22-b67d-19b66270e066
from RUNNING to DESTROYING
I0507 08:27:32.384493 17720 launcher.cpp:156] Asked to destroy container 2f9bdd3f-b3cd-4b22-b67d-19b66270e066
I0507 08:27:32.488541 14784 containerizer.cpp:2835] Container 2f9bdd3f-b3cd-4b22-b67d-19b66270e066
has exited
I0507 08:27:32.522547 18876 master.cpp:1135] Master terminating
I0507 08:27:32.524546 13752 hierarchical.cpp:625] Removed agent 3b1ef1d4-c2b8-4f24-b9f3-ab38c76a3626-S0
I0507 08:27:33.010571 12316 process.cpp:940] Stopped the socket accept loop
```

- Mesos Reviewbot Windows


On May 7, 2018, 6:24 a.m., Meng Zhu wrote:
> 
> -----------------------------------------------------------
> This is an automatically generated e-mail. To reply, visit:
> https://reviews.apache.org/r/66984/
> -----------------------------------------------------------
> 
> (Updated May 7, 2018, 6:24 a.m.)
> 
> 
> Review request for mesos, Benjamin Mahler, Kapil Arya, Till Toenshoff, and Vinod Kone.
> 
> 
> Repository: mesos
> 
> 
> Description
> -------
> 
> This is still WIP. Comments and feedbacks are welcome.
> 
> 
> Diffs
> -----
> 
>   src/master/allocator/mesos/hierarchical.hpp 955ae3e6a9e3c790fb260311ec4b4ef725a826d3

>   src/master/allocator/mesos/hierarchical.cpp 1000968be6a2935a4cac571414d7f06d7df7acf0

> 
> 
> Diff: https://reviews.apache.org/r/66984/diff/1/
> 
> 
> Testing
> -------
> 
> 
> Thanks,
> 
> Meng Zhu
> 
>


Mime
  • Unnamed multipart/alternative (inline, None, 0 bytes)
View raw message