mesos-reviews mailing list archives

Site index · List index
Message view « Date » · « Thread »
Top « Date » · « Thread »
From Mesos Reviewbot Windows <revi...@mesos.apache.org>
Subject Re: Review Request 66924: Made the master include the operation ID in OPERATION_DROPPED updates.
Date Sat, 05 May 2018 02:57:41 GMT

-----------------------------------------------------------
This is an automatically generated e-mail. To reply, visit:
https://reviews.apache.org/r/66924/#review202515
-----------------------------------------------------------



FAIL: Some of the unit tests failed. Please check the relevant logs.

Reviews applied: `['66924']`

Failed command: `Start-MesosCITesting`

All the build artifacts available at: http://dcos-win.westus.cloudapp.azure.com/mesos-build/review/66924

Relevant logs:

- [mesos-tests-stdout.log](http://dcos-win.westus.cloudapp.azure.com/mesos-build/review/66924/logs/mesos-tests-stdout.log):

```
[       OK ] Endpoint/SlaveEndpointTest.NoAuthorizer/2 (112 ms)
[----------] 9 tests from Endpoint/SlaveEndpointTest (1078 ms total)

[----------] 2 tests from ContainerizerType/DefaultContainerDNSFlagTest
[ RUN      ] ContainerizerType/DefaultContainerDNSFlagTest.ValidateFlag/0
[       OK ] ContainerizerType/DefaultContainerDNSFlagTest.ValidateFlag/0 (31 ms)
[ RUN      ] ContainerizerType/DefaultContainerDNSFlagTest.ValidateFlag/1
[       OK ] ContainerizerType/DefaultContainerDNSFlagTest.ValidateFlag/1 (38 ms)
[----------] 2 tests from ContainerizerType/DefaultContainerDNSFlagTest (72 ms total)

[----------] 1 test from IsolationFlag/CpuIsolatorTest
[ RUN      ] IsolationFlag/CpuIsolatorTest.ROOT_UserCpuUsage/0
[       OK ] IsolationFlag/CpuIsolatorTest.ROOT_UserCpuUsage/0 (694 ms)
[----------] 1 test from IsolationFlag/CpuIsolatorTest (717 ms total)

[----------] 1 test from IsolationFlag/MemoryIsolatorTest
[ RUN      ] IsolationFlag/MemoryIsolatorTest.ROOT_MemUsage/0
[       OK ] IsolationFlag/MemoryIsolatorTest.ROOT_MemUsage/0 (718 ms)
[----------] 1 test from IsolationFlag/MemoryIsolatorTest (742 ms total)

[----------] Global test environment tear-down
[==========] 979 tests from 95 test cases ran. (462086 ms total)
[  PASSED  ] 978 tests.
[  FAILED  ] 1 test, listed below:
[  FAILED  ] SlaveTest.RestartSlaveRequireExecutorAuthentication

 1 FAILED TEST
  YOU HAVE 219 DISABLED TESTS

```

- [mesos-tests-stderr.log](http://dcos-win.westus.cloudapp.azure.com/mesos-build/review/66924/logs/mesos-tests-stderr.log):

```
I0505 02:57:27.794875 17052 slave.cpp:3935] Shutting down framework 969dced1-813a-48ea-be45-24a8a2cbb9b2-0000
I0505 02:57:27.794875  5632 master.cpp:10831] Updating the state of task 7a1fa960-8267-418b-8978-39ac35d37287
of framework 969dced1-813a-48ea-be45-24a8a2cbb9b2-0000 (latest state: TASK_KILLED, status
update state: TASK_KILLED)
I0505 02:57:27.794875 17052 slave.cpp:6656] ShuttI0505 02:57:27.633867 15408 exec.cpp:162]
Version: 1.6.0
I0505 02:57:27.659853  2712 exec.cpp:236] Executor registered on agent 969dced1-813a-48ea-be45-24a8a2cbb9b2-S0
I0505 02:57:27.663861 15328 executor.cpp:178] Received SUBSCRIBED event
I0505 02:57:27.667856 15328 executor.cpp:182] Subscribed executor on winbldsrv-01.zq4gs31qjdiunm1ryi1452nvnh.dx.internal.cloudapp.net
I0505 02:57:27.668855 15328 executor.cpp:178] Received LAUNCH event
I0505 02:57:27.672873 15328 executor.cpp:665] Starting task 7a1fa960-8267-418b-8978-39ac35d37287
I0505 02:57:27.752871 15328 executor.cpp:485] Running 'D:\DCOS\mesos\src\mesos-containerizer.exe
launch <POSSIBLY-SENSITIVE-DATA>'
I0505 02:57:27.764875 15328 executor.cpp:678] Forked command at 10752
I0505 02:57:27.796874 16336 exec.cpp:445] Executor asked to shutdown
I0505 02:57:27.797874 12124 executor.cpp:178] Received SHUTDOWN event
I0505 02:57:27.797874 12124 executor.cpp:781] Shutting down
I0505 02:57:27.797874 12124 executor.cpp:894] Sending SIGTERM to process tree at pid ing down
executor '7a1fa960-8267-418b-8978-39ac35d37287' of framework 969dced1-813a-48ea-be45-24a8a2cbb9b2-0000
at executor(1)@10.3.1.8:58856
I0505 02:57:27.796874 17052 slave.cpp:929] Agent terminating
W0505 02:57:27.796874 17052 slave.cpp:3931] Ignoring shutdown framework 969dced1-813a-48ea-be45-24a8a2cbb9b2-0000
because it is terminating
I0505 02:57:27.797874  5632 master.cpp:10930] Removing task 7a1fa960-8267-418b-8978-39ac35d37287
with resources cpus(allocated: *):4; mem(allocated: *):2048; disk(allocated: *):1024; ports(allocated:
*):[31000-32000] of framework 969dced1-813a-48ea-be45-24a8a2cbb9b2-0000 on agent 969dced1-813a-48ea-be45-24a8a2cbb9b2-S0
at slave(444)@10.3.1.8:58835 (winbldsrv-01.zq4gs31qjdiunm1ryi1452nvnh.dx.internal.cloudapp.net)
I0505 02:57:27.800869  5632 master.cpp:1293] Agent 969dced1-813a-48ea-be45-24a8a2cbb9b2-S0
at slave(444)@10.3.1.8:58835 (winbldsrv-01.zq4gs31qjdiunm1ryi1452nvnh.dx.internal.cloudapp.net)
disconnected
I0505 02:57:27.800869  5632 master.cpp:3299] Disconnecting agent 969dced1-813a-48ea-be45-24a8a2cbb9b2-S0
at slave(444)@10.3.1.8:58835 (winbldsrv-01.zq4gs31qjdiunm1ryi1452nvnh.dx.internal.cloudapp.net)
I0505 02:57:27.801872 14452 hierarchical.cpp:344] Removed framework 969dced1-813a-48ea-be45-24a8a2cbb9b2-0000
I0505 02:57:27.801872  5632 master.cpp:3318] Deactivating agent 969dced1-813a-48ea-be45-24a8a2cbb9b2-S0
at slave(444)@10.3.1.8:58835 (winbldsrv-01.zq4gs31qjdiunm1ryi1452nvnh.dx.internal.cloudapp.net)
I0505 02:57:27.801872 17052 hierarchical.cpp:766] Agent 969dced1-813a-48ea-be45-24a8a2cbb9b2-S0
deactivated
I0505 02:57:27.801872 15596 containerizer.cpp:2382] Destroying container 5ee01cc6-fafd-4875-b24f-1944fecf849c
in RUNNING state
I0505 02:57:27.801872 15596 containerizer.cpp:2996] Transitioning the state of container 5ee01cc6-fafd-4875-b24f-1944fecf849c
from RUNNING to DESTROYING
I0505 02:57:27.802870 15596 launcher.cpp:156] Asked to destroy container 5ee01cc6-fafd-4875-b24f-1944fecf849c
I0505 02:57:27.816874 11452 containerizer.cpp:2835] Container 5ee01cc6-fafd-4875-b24f-1944fecf849c
has exited
I0505 02:57:27.849654  6852 master.cpp:1135] Master terminating
I0505 02:57:27.851656 17432 hierarchical.cpp:609] Removed agent 969dced1-813a-48ea-be45-24a8a2cbb9b2-S0
I0505 02:57:28.318686  9572 process.cpp:940] Stopped the socket accept loop
```

- Mesos Reviewbot Windows


On May 4, 2018, 11:37 p.m., Gaston Kleiman wrote:
> 
> -----------------------------------------------------------
> This is an automatically generated e-mail. To reply, visit:
> https://reviews.apache.org/r/66924/
> -----------------------------------------------------------
> 
> (Updated May 4, 2018, 11:37 p.m.)
> 
> 
> Review request for mesos, Benjamin Bannier, Chun-Hung Hsiao, and Greg Mann.
> 
> 
> Bugs: MESOS-8784
>     https://issues.apache.org/jira/browse/MESOS-8784
> 
> 
> Repository: mesos
> 
> 
> Description
> -------
> 
> Made the master include the operation ID in OPERATION_DROPPED updates.
> 
> 
> Diffs
> -----
> 
>   src/master/master.hpp 76e7763a99972f686af9d7eed08b6b6b1db23b0f 
>   src/master/master.cpp 3b5d2eba3f602f68a6bb1e00444b01fb58a1bfc2 
>   src/tests/master_slave_reconciliation_tests.cpp 71e22af7ac3b7bc4c72340274961db16d7355e7d

>   src/tests/mesos.hpp 8da3b021874097c5b66e5bc7d9fdafcc8fc377ef 
> 
> 
> Diff: https://reviews.apache.org/r/66924/diff/2/
> 
> 
> Testing
> -------
> 
> `make check` on GNU/Linux.
> 
> 
> The test in this patch fails without the corresponding master change, but succeeds with
it applied.
> 
> 
> Thanks,
> 
> Gaston Kleiman
> 
>


Mime
  • Unnamed multipart/alternative (inline, None, 0 bytes)
View raw message