mesos-reviews mailing list archives

Site index · List index
Message view « Date » · « Thread »
Top « Date » · « Thread »
From Mesos Reviewbot Windows <revi...@mesos.apache.org>
Subject Re: Review Request 66227: Added test for `GROW_VOLUME` and `SHRINK_VOLUME` operator API.
Date Wed, 02 May 2018 19:06:36 GMT

-----------------------------------------------------------
This is an automatically generated e-mail. To reply, visit:
https://reviews.apache.org/r/66227/#review202305
-----------------------------------------------------------



FAIL: Some of the unit tests failed. Please check the relevant logs.

Reviews applied: `['66218', '66049', '66733', '66050', '66219', '66858', '66220', '66531',
'66532', '66052', '66051', '66227']`

Failed command: `Start-MesosCITesting`

All the build artifacts available at: http://dcos-win.westus.cloudapp.azure.com/mesos-build/review/66227

Relevant logs:

- [mesos-tests-stdout.log](http://dcos-win.westus.cloudapp.azure.com/mesos-build/review/66227/logs/mesos-tests-stdout.log):

```
[----------] 9 tests from Endpoint/SlaveEndpointTest (1052 ms total)

[----------] 2 tests from ContainerizerType/DefaultContainerDNSFlagTest
[ RUN      ] ContainerizerType/DefaultContainerDNSFlagTest.ValidateFlag/0
[       OK ] ContainerizerType/DefaultContainerDNSFlagTest.ValidateFlag/0 (32 ms)
[ RUN      ] ContainerizerType/DefaultContainerDNSFlagTest.ValidateFlag/1
[       OK ] ContainerizerType/DefaultContainerDNSFlagTest.ValidateFlag/1 (40 ms)
[----------] 2 tests from ContainerizerType/DefaultContainerDNSFlagTest (74 ms total)

[----------] 1 test from IsolationFlag/CpuIsolatorTest
[ RUN      ] IsolationFlag/CpuIsolatorTest.ROOT_UserCpuUsage/0
[       OK ] IsolationFlag/CpuIsolatorTest.ROOT_UserCpuUsage/0 (735 ms)
[----------] 1 test from IsolationFlag/CpuIsolatorTest (761 ms total)

[----------] 1 test from IsolationFlag/MemoryIsolatorTest
[ RUN      ] IsolationFlag/MemoryIsolatorTest.ROOT_MemUsage/0
[       OK ] IsolationFlag/MemoryIsolatorTest.ROOT_MemUsage/0 (820 ms)
[----------] 1 test from IsolationFlag/MemoryIsolatorTest (846 ms total)

[----------] Global test environment tear-down
[==========] 971 tests from 95 test cases ran. (468797 ms total)
[  PASSED  ] 969 tests.
[  FAILED  ] 2 tests, listed below:
[  FAILED  ] ContentType/ResourceProviderManagerHttpApiTest.ResubscribeResourceProvider/0,
where GetParam() = application/x-protobuf
[  FAILED  ] ContentType/ResourceProviderManagerHttpApiTest.ResubscribeResourceProvider/1,
where GetParam() = application/json

 2 FAILED TESTS
  YOU HAVE 220 DISABLED TESTS

```

- [mesos-tests-stderr.log](http://dcos-win.westus.cloudapp.azure.com/mesos-build/review/66227/logs/mesos-tests-stderr.log):

```
I0502 19:06:20.751076  2308 master.cpp:10787] Updating the state of task d5d07158-bfff-4120-bfd6-e245aabfdbf4
of framework 25977124-b368-4fff-ae64-c44cc50adab6-0000 (latest state: TASK_KILLED, status
update state: TASK_KILLED)
I0502 19:I0502 19:06:20.580087  3216 exec.cpp:162] Version: 1.6.0
I0502 19:06:20.607092 11372 exec.cpp:236] Executor registered on agent 25977124-b368-4fff-ae64-c44cc50adab6-S0
I0502 19:06:20.611101  9536 executor.cpp:177] Received SUBSCRIBED event
I0502 19:06:20.616091  9536 executor.cpp:181] Subscribed executor on winbldsrv-01.zq4gs31qjdiunm1ryi1452nvnh.dx.internal.cloudapp.net
I0502 19:06:20.616091  9536 executor.cpp:177] Received LAUNCH event
I0502 19:06:20.622112  9536 executor.cpp:649] Starting task d5d07158-bfff-4120-bfd6-e245aabfdbf4
I0502 19:06:20.712095  9536 executor.cpp:484] Running 'D:\DCOS\mesos\src\mesos-containerizer.exe
launch <POSSIBLY-SENSITIVE-DATA>'
I0502 19:06:20.725108  9536 executor.cpp:662] Forked command at 9540
I0502 19:06:20.754078  5468 exec.cpp:445] Executor asked to shutdown
I0502 19:06:20.755075  7228 executor.cpp:177] Received SHUTDOWN event
I0502 19:06:20.755075  7228 executor.cpp:759] Shutting down
I0502 19:06:20.755075  7228 executor.cpp:869] Sending SIGTERM to process tree at pid 906:20.752136
 7176 slave.cpp:3935] Shutting down framework 25977124-b368-4fff-ae64-c44cc50adab6-0000
I0502 19:06:20.752136  7176 slave.cpp:6656] Shutting down executor 'd5d07158-bfff-4120-bfd6-e245aabfdbf4'
of framework 25977124-b368-4fff-ae64-c44cc50adab6-0000 at executor(1)@10.3.1.8:62605
I0502 19:06:20.754078  2308 master.cpp:10886] Removing task d5d07158-bfff-4120-bfd6-e245aabfdbf4
with resources cpus(allocated: *):4; mem(allocated: *):2048; disk(allocated: *):1024; ports(allocated:
*):[31000-32000] of framework 25977124-b368-4fff-ae64-c44cc50adab6-0000 on agent 25977124-b368-4fff-ae64-c44cc50adab6-S0
at slave(438)@10.3.1.8:62584 (winbldsrv-01.zq4gs31qjdiunm1ryi1452nvnh.dx.internal.cloudapp.net)
I0502 19:06:20.754078  7176 slave.cpp:929] Agent terminating
W0502 19:06:20.754078  7176 slave.cpp:3931] Ignoring shutdown framework 25977124-b368-4fff-ae64-c44cc50adab6-0000
because it is terminating
I0502 19:06:20.757067 10356 master.cpp:1296] Agent 25977124-b368-4fff-ae64-c44cc50adab6-S0
at slave(438)@10.3.1.8:62584 (winbldsrv-01.zq4gs31qjdiunm1ryi1452nvnh.dx.internal.cloudapp.net)
disconnected
I0502 19:06:20.757067 10356 master.cpp:3296] Disconnecting agent 25977124-b368-4fff-ae64-c44cc50adab6-S0
at slave(438)@10.3.1.8:62584 (winbldsrv-01.zq4gs31qjdiunm1ryi1452nvnh.dx.internal.cloudapp.net)
I0502 19:06:20.757067 10356 master.cpp:3315] Deactivating agent 25977124-b368-4fff-ae64-c44cc50adab6-S0
at slave(438)@10.3.1.8:62584 (winbldsrv-01.zq4gs31qjdiunm1ryi1452nvnh.dx.internal.cloudapp.net)
I0502 19:06:20.758069 13220 hierarchical.cpp:344] Removed framework 25977124-b368-4fff-ae64-c44cc50adab6-0000
I0502 19:06:20.758069 13220 hierarchical.cpp:766] Agent 25977124-b368-4fff-ae64-c44cc50adab6-S0
deactivated
I0502 19:06:20.759093  6412 containerizer.cpp:2378] Destroying container 4abef5dd-260f-4f0d-860f-727a40d2f659
in RUNNING state
I0502 19:06:20.759093  6412 containerizer.cpp:2992] Transitioning the state of container 4abef5dd-260f-4f0d-860f-727a40d2f659
from RUNNING to DESTROYING
I0502 19:06:20.760068  6412 launcher.cpp:156] Asked to destroy container 4abef5dd-260f-4f0d-860f-727a40d2f659
I0502 19:06:20.850126  6248 containerizer.cpp:2831] Container 4abef5dd-260f-4f0d-860f-727a40d2f659
has exited
I0502 19:06:20.882091  4900 master.cpp:1138] Master terminating
I0502 19:06:20.884089  9796 hierarchical.cpp:609] Removed agent 25977124-b368-4fff-ae64-c44cc50adab6-S0
I0502 19:06:21.332108 11116 process.cpp:940] Stopped the socket accept loop
```

- Mesos Reviewbot Windows


On May 2, 2018, 5:28 p.m., Zhitao Li wrote:
> 
> -----------------------------------------------------------
> This is an automatically generated e-mail. To reply, visit:
> https://reviews.apache.org/r/66227/
> -----------------------------------------------------------
> 
> (Updated May 2, 2018, 5:28 p.m.)
> 
> 
> Review request for mesos, Chun-Hung Hsiao, Gaston Kleiman, and Greg Mann.
> 
> 
> Bugs: MESOS-8747
>     https://issues.apache.org/jira/browse/MESOS-8747
> 
> 
> Repository: mesos
> 
> 
> Description
> -------
> 
> Added test for `GROW_VOLUME` and `SHRINK_VOLUME` operator API.
> 
> 
> Diffs
> -----
> 
>   src/tests/api_tests.cpp dd8e221d8fd1b2a241505345337897e4ee4a6347 
> 
> 
> Diff: https://reviews.apache.org/r/66227/diff/8/
> 
> 
> Testing
> -------
> 
> 
> Thanks,
> 
> Zhitao Li
> 
>


Mime
  • Unnamed multipart/alternative (inline, None, 0 bytes)
View raw message