mesos-reviews mailing list archives

Site index · List index
Message view « Date » · « Thread »
Top « Date » · « Thread »
From Mesos Reviewbot Windows <revi...@mesos.apache.org>
Subject Re: Review Request 66901: Add the ASF events link to the website.
Date Wed, 02 May 2018 04:34:50 GMT

-----------------------------------------------------------
This is an automatically generated e-mail. To reply, visit:
https://reviews.apache.org/r/66901/#review202254
-----------------------------------------------------------



FAIL: Some of the unit tests failed. Please check the relevant logs.

Reviews applied: `['66901']`

Failed command: `Start-MesosCITesting`

All the build artifacts available at: http://dcos-win.westus.cloudapp.azure.com/mesos-build/review/66901

Relevant logs:

- [mesos-tests-stdout.log](http://dcos-win.westus.cloudapp.azure.com/mesos-build/review/66901/logs/mesos-tests-stdout.log):

```
[----------] 9 tests from Endpoint/SlaveEndpointTest (1042 ms total)

[----------] 2 tests from ContainerizerType/DefaultContainerDNSFlagTest
[ RUN      ] ContainerizerType/DefaultContainerDNSFlagTest.ValidateFlag/0
[       OK ] ContainerizerType/DefaultContainerDNSFlagTest.ValidateFlag/0 (56 ms)
[ RUN      ] ContainerizerType/DefaultContainerDNSFlagTest.ValidateFlag/1
[       OK ] ContainerizerType/DefaultContainerDNSFlagTest.ValidateFlag/1 (37 ms)
[----------] 2 tests from ContainerizerType/DefaultContainerDNSFlagTest (95 ms total)

[----------] 1 test from IsolationFlag/CpuIsolatorTest
[ RUN      ] IsolationFlag/CpuIsolatorTest.ROOT_UserCpuUsage/0
[       OK ] IsolationFlag/CpuIsolatorTest.ROOT_UserCpuUsage/0 (733 ms)
[----------] 1 test from IsolationFlag/CpuIsolatorTest (756 ms total)

[----------] 1 test from IsolationFlag/MemoryIsolatorTest
[ RUN      ] IsolationFlag/MemoryIsolatorTest.ROOT_MemUsage/0
[       OK ] IsolationFlag/MemoryIsolatorTest.ROOT_MemUsage/0 (733 ms)
[----------] 1 test from IsolationFlag/MemoryIsolatorTest (757 ms total)

[----------] Global test environment tear-down
[==========] 970 tests from 95 test cases ran. (456599 ms total)
[  PASSED  ] 968 tests.
[  FAILED  ] 2 tests, listed below:
[  FAILED  ] ContentType/ResourceProviderManagerHttpApiTest.ResubscribeResourceProvider/0,
where GetParam() = application/x-protobuf
[  FAILED  ] ContentType/ResourceProviderManagerHttpApiTest.ResubscribeResourceProvider/1,
where GetParam() = application/json

 2 FAILED TESTS
  YOU HAVE 216 DISABLED TESTS

```

- [mesos-tests-stderr.log](http://dcos-win.westus.cloudapp.azure.com/mesos-build/review/66901/logs/mesos-tests-stderr.log):

```
I0502 04:34:36.625301  7864 executor.cpp:177] Received SUBSCRIBED event
I0502 04:34:36.630300  7864 executor.cpp:181] Subscribed executor on winbldsrv-02.zq4gs31qjdiunm1ryi1452nvnh.dx.internal.cloudapp.net
I0502 04:34:36.631300  7864 executor.cpp:177] Received LAUNCH event
I0502 04:34:36.636314  7864 executor.cpp:649] Starting task e45e388f-fdef-4fbb-bbab-48ef36d98cc5
I0502 04:34:36.723333  7864 executor.cpp:484] Running 'D:\DCOS\mesos\src\mesos-containerizer.exe
launch <POSSIBLY-SENSITIVE-DATA>'
I0502 04:34:36.737327  7864 executor.cpp:662] Forked command at 5360
I0502 04:34:36.769330  7940 exec.cpp:445] Executor asked to shutdown
I0502 04:34:36.769330  1116 executor.cpp:177] Received SHUTDOWN event
I0502 04:34:36.769330  1116 executor.cpp:759] Shutting down
I0502 04:34:36.769330  1116 executor.cpp:869] Sending SIGTERM to process tree at pid 56330
 7332 master.cpp:3259] Deactivating framework a27eff9d-3abf-43c3-94c0-54e8825eff61-0000 (default)
at scheduler-4ad44d3a-4fb0-48eb-9842-aed37fd9cc40@10.3.1.5:56605
I0502 04:34:36.767333 10584 hierarchical.cpp:405] Deactivated framework a27eff9d-3abf-43c3-94c0-54e8825eff61-0000
I0502 04:34:36.767333  7332 master.cpp:10547] Updating the state of task e45e388f-fdef-4fbb-bbab-48ef36d98cc5
of framework a27eff9d-3abf-43c3-94c0-54e8825eff61-0000 (latest state: TASK_KILLED, status
update state: TASK_KILLED)
I0502 04:34:36.767333  3108 slave.cpp:3935] Shutting down framework a27eff9d-3abf-43c3-94c0-54e8825eff61-0000
I0502 04:34:36.767333  3108 slave.cpp:6644] Shutting down executor 'e45e388f-fdef-4fbb-bbab-48ef36d98cc5'
of framework a27eff9d-3abf-43c3-94c0-54e8825eff61-0000 at executor(1)@10.3.1.5:56626
I0502 04:34:36.768326  3108 slave.cpp:929] Agent terminating
W0502 04:34:36.769330  3108 slave.cpp:3931] Ignoring shutdown framework a27eff9d-3abf-43c3-94c0-54e8825eff61-0000
because it is terminating
I0502 04:34:36.769330  7332 master.cpp:10646] Removing task e45e388f-fdef-4fbb-bbab-48ef36d98cc5
with resources cpus(allocated: *):4; mem(allocated: *):2048; disk(allocated: *):1024; ports(allocated:
*):[31000-32000] of framework a27eff9d-3abf-43c3-94c0-54e8825eff61-0000 on agent a27eff9d-3abf-43c3-94c0-54e8825eff61-S0
at slave(438)@10.3.1.5:56605 (winbldsrv-02.zq4gs31qjdiunm1ryi1452nvnh.dx.internal.cloudapp.net)
I0502 04:34:36.773326  7332 master.cpp:1296] Agent a27eff9d-3abf-43c3-94c0-54e8825eff61-S0
at slave(438)@10.3.1.5:56605 (winbldsrv-02.zq4gs31qjdiunm1ryi1452nvnh.dx.internal.cloudapp.net)
disconnected
I0502 04:34:36.773326  7332 master.cpp:3296] Disconnecting agent a27eff9d-3abf-43c3-94c0-54e8825eff61-S0
at slave(438)@10.3.1.5:56605 (winbldsrv-02.zq4gs31qjdiunm1ryi1452nvnh.dx.internal.cloudapp.net)
I0502 04:34:36.773326  7332 master.cpp:3315] Deactivating agent a27eff9d-3abf-43c3-94c0-54e8825eff61-S0
at slave(438)@10.3.1.5:56605 (winbldsrv-02.zq4gs31qjdiunm1ryi1452nvnh.dx.internal.cloudapp.net)
I0502 04:34:36.773326  7252 hierarchical.cpp:344] Removed framework a27eff9d-3abf-43c3-94c0-54e8825eff61-0000
I0502 04:34:36.774320  7356 containerizer.cpp:2378] Destroying container 2f3af11c-07b9-4619-8a1e-ea613da551e7
in RUNNING state
I0502 04:34:36.774320  7356 containerizer.cpp:2992] Transitioning the state of container 2f3af11c-07b9-4619-8a1e-ea613da551e7
from RUNNING to DESTROYING
I0502 04:34:36.774320  7252 hierarchical.cpp:766] Agent a27eff9d-3abf-43c3-94c0-54e8825eff61-S0
deactivated
I0502 04:34:36.774320  7356 launcher.cpp:156] Asked to destroy container 2f3af11c-07b9-4619-8a1e-ea613da551e7
I0502 04:34:36.833328 11728 containerizer.cpp:2831] Container 2f3af11c-07b9-4619-8a1e-ea613da551e7
has exited
I0502 04:34:36.866336  3800 master.cpp:1138] Master terminating
I0502 04:34:36.868314 11752 hierarchical.cpp:609] Removed agent a27eff9d-3abf-43c3-94c0-54e8825eff61-S0
I0502 04:34:37.304345  4544 process.cpp:940] Stopped the socket accept loop
```

- Mesos Reviewbot Windows


On May 2, 2018, 3:36 a.m., James Peach wrote:
> 
> -----------------------------------------------------------
> This is an automatically generated e-mail. To reply, visit:
> https://reviews.apache.org/r/66901/
> -----------------------------------------------------------
> 
> (Updated May 2, 2018, 3:36 a.m.)
> 
> 
> Review request for mesos, Benjamin Mahler, Greg Mann, and Vinod Kone.
> 
> 
> Repository: mesos
> 
> 
> Description
> -------
> 
> Update the Mesos website the ASF current event banner described
> in http://apache.org/events/README.txt. This is a dynamic banner
> that will be updated automatically without the need to update the
> website every time for every new event.
> 
> 
> Diffs
> -----
> 
>   site/source/layouts/basic.erb 30ae845b88e5247b623f861b1f1c2f4681922380 
> 
> 
> Diff: https://reviews.apache.org/r/66901/diff/1/
> 
> 
> Testing
> -------
> 
> View website. The image looks like [this](https://pasteboard.co/HjfTvkc.png).
> 
> 
> Thanks,
> 
> James Peach
> 
>


Mime
  • Unnamed multipart/alternative (inline, None, 0 bytes)
View raw message