mesos-reviews mailing list archives

Site index · List index
Message view « Date » · « Thread »
Top « Date » · « Thread »
From Mesos Reviewbot Windows <revi...@mesos.apache.org>
Subject Re: Review Request 66696: Updated documentation for operation feedback.
Date Sat, 21 Apr 2018 00:16:48 GMT

-----------------------------------------------------------
This is an automatically generated e-mail. To reply, visit:
https://reviews.apache.org/r/66696/#review201675
-----------------------------------------------------------



FAIL: Some of the unit tests failed. Please check the relevant logs.

Reviews applied: `['66458', '66459', '66461', '66489', '66462', '66463', '66464', '66465',
'66466', '66467', '66468', '66696']`

Failed command: `Start-MesosCITesting`

All the build artifacts available at: http://dcos-win.westus.cloudapp.azure.com/mesos-build/review/66696

Relevant logs:

- [mesos-tests-cmake-stdout.log](http://dcos-win.westus.cloudapp.azure.com/mesos-build/review/66696/logs/mesos-tests-cmake-stdout.log):

```
         d:\dcos\mesos\3rdparty\zookeeper-3.4.8\src\zookeeper-3.4.8\src\c\src\winport.c(166):
warning C4716: 'pthread_cond_broadcast': must return a value [D:\DCOS\mesos\3rdparty\zookeeper-3.4.8\src\zookeeper-3.4.8-build\zookeeper.vcxproj]
[D:\DCOS\mesos\3rdparty\zookeeper-3.4.8.vcxproj]
         d:\dcos\mesos\3rdparty\zookeeper-3.4.8\src\zookeeper-3.4.8\src\c\src\winport.c(205):
warning C4716: 'pthread_cond_wait': must return a value [D:\DCOS\mesos\3rdparty\zookeeper-3.4.8\src\zookeeper-3.4.8-build\zookeeper.vcxproj]
[D:\DCOS\mesos\3rdparty\zookeeper-3.4.8.vcxproj]
         d:\dcos\mesos\3rdparty\zookeeper-3.4.8\src\zookeeper-3.4.8\src\c\src\cli.c(124):
warning C4996: 'fopen': This function or variable may be unsafe. Consider using fopen_s instead.
To disable deprecation, use _CRT_SECURE_NO_WARNINGS. See online help for details. [D:\DCOS\mesos\3rdparty\zookeeper-3.4.8\src\zookeeper-3.4.8-build\cli.vcxproj]
[D:\DCOS\mesos\3rdparty\zookeeper-3.4.8.vcxproj]
         d:\dcos\mesos\3rdparty\zookeeper-3.4.8\src\zookeeper-3.4.8\src\c\src\cli.c(128):
warning C4267: 'initializing': conversion from 'size_t' to 'int', possible loss of data [D:\DCOS\mesos\3rdparty\zookeeper-3.4.8\src\zookeeper-3.4.8-build\cli.vcxproj]
[D:\DCOS\mesos\3rdparty\zookeeper-3.4.8.vcxproj]
         d:\dcos\mesos\3rdparty\zookeeper-3.4.8\src\zookeeper-3.4.8\src\c\src\cli.c(279):
warning C4267: 'function': conversion from 'size_t' to 'int', possible loss of data [D:\DCOS\mesos\3rdparty\zookeeper-3.4.8\src\zookeeper-3.4.8-build\cli.vcxproj]
[D:\DCOS\mesos\3rdparty\zookeeper-3.4.8.vcxproj]
         d:\dcos\mesos\3rdparty\zookeeper-3.4.8\src\zookeeper-3.4.8\src\c\src\cli.c(301):
warning C4267: 'initializing': conversion from 'size_t' to 'int', possible loss of data [D:\DCOS\mesos\3rdparty\zookeeper-3.4.8\src\zookeeper-3.4.8-build\cli.vcxproj]
[D:\DCOS\mesos\3rdparty\zookeeper-3.4.8.vcxproj]
         d:\dcos\mesos\3rdparty\zookeeper-3.4.8\src\zookeeper-3.4.8\src\c\src\cli.c(368):
warning C4267: 'function': conversion from 'size_t' to 'int', possible loss of data [D:\DCOS\mesos\3rdparty\zookeeper-3.4.8\src\zookeeper-3.4.8-build\cli.vcxproj]
[D:\DCOS\mesos\3rdparty\zookeeper-3.4.8.vcxproj]
         d:\dcos\mesos\3rdparty\zookeeper-3.4.8\src\zookeeper-3.4.8\src\c\src\cli.c(372):
warning C4267: 'function': conversion from 'size_t' to 'int', possible loss of data [D:\DCOS\mesos\3rdparty\zookeeper-3.4.8\src\zookeeper-3.4.8-build\cli.vcxproj]
[D:\DCOS\mesos\3rdparty\zookeeper-3.4.8.vcxproj]
         d:\dcos\mesos\3rdparty\zookeeper-3.4.8\src\zookeeper-3.4.8\src\c\src\cli.c(512):
warning C4267: 'function': conversion from 'size_t' to 'int', possible loss of data [D:\DCOS\mesos\3rdparty\zookeeper-3.4.8\src\zookeeper-3.4.8-build\cli.vcxproj]
[D:\DCOS\mesos\3rdparty\zookeeper-3.4.8.vcxproj]
         d:\dcos\mesos\3rdparty\zookeeper-3.4.8\src\zookeeper-3.4.8\src\c\src\cli.c(543):
warning C4996: 'strcpy': This function or variable may be unsafe. Consider using strcpy_s
instead. To disable deprecation, use _CRT_SECURE_NO_WARNINGS. See online help for details.
[D:\DCOS\mesos\3rdparty\zookeeper-3.4.8\src\zookeeper-3.4.8-build\cli.vcxproj] [D:\DCOS\mesos\3rdparty\zookeeper-3.4.8.vcxproj]
         d:\dcos\mesos\3rdparty\zookeeper-3.4.8\src\zookeeper-3.4.8\src\c\src\cli.c(548):
warning C4996: 'fopen': This function or variable may be unsafe. Consider using fopen_s instead.
To disable deprecation, use _CRT_SECURE_NO_WARNINGS. See online help for details. [D:\DCOS\mesos\3rdparty\zookeeper-3.4.8\src\zookeeper-3.4.8-build\cli.vcxproj]
[D:\DCOS\mesos\3rdparty\zookeeper-3.4.8.vcxproj]
         d:\dcos\mesos\3rdparty\zookeeper-3.4.8\src\zookeeper-3.4.8\src\c\src\cli.c(569):
warning C4996: 'strcpy': This function or variable may be unsafe. Consider using strcpy_s
instead. To disable deprecation, use _CRT_SECURE_NO_WARNINGS. See online help for details.
[D:\DCOS\mesos\3rdparty\zookeeper-3.4.8\src\zookeeper-3.4.8-build\cli.vcxproj] [D:\DCOS\mesos\3rdparty\zookeeper-3.4.8.vcxproj]


       "D:\DCOS\mesos\src\tests\mesos-tests.vcxproj" (default target) (1) ->
       (ClCompile target) -> 
         d:\dcos\mesos\mesos\src\tests\operation_reconciliation_tests.cpp(141): error C2039:
'call': is not a member of 'mesos::internal::tests::scheduler::TestMesos<mesos::v1::scheduler::Mesos,mesos::v1::scheduler::Event>'
[D:\DCOS\mesos\src\tests\mesos-tests.vcxproj]
         d:\dcos\mesos\mesos\src\tests\operation_reconciliation_tests.cpp(234): error C2039:
'call': is not a member of 'mesos::internal::tests::scheduler::TestMesos<mesos::v1::scheduler::Mesos,mesos::v1::scheduler::Event>'
[D:\DCOS\mesos\src\tests\mesos-tests.vcxproj]
         d:\dcos\mesos\mesos\src\tests\operation_reconciliation_tests.cpp(310): error C2039:
'call': is not a member of 'mesos::internal::tests::scheduler::TestMesos<mesos::v1::scheduler::Mesos,mesos::v1::scheduler::Event>'
[D:\DCOS\mesos\src\tests\mesos-tests.vcxproj]
         d:\dcos\mesos\mesos\src\tests\operation_reconciliation_tests.cpp(412): error C2039:
'call': is not a member of 'mesos::internal::tests::scheduler::TestMesos<mesos::v1::scheduler::Mesos,mesos::v1::scheduler::Event>'
[D:\DCOS\mesos\src\tests\mesos-tests.vcxproj]
         d:\dcos\mesos\mesos\src\tests\operation_reconciliation_tests.cpp(507): error C2039:
'call': is not a member of 'mesos::internal::tests::scheduler::TestMesos<mesos::v1::scheduler::Mesos,mesos::v1::scheduler::Event>'
[D:\DCOS\mesos\src\tests\mesos-tests.vcxproj]
         d:\dcos\mesos\mesos\src\tests\operation_reconciliation_tests.cpp(571): error C2039:
'call': is not a member of 'mesos::internal::tests::scheduler::TestMesos<mesos::v1::scheduler::Mesos,mesos::v1::scheduler::Event>'
[D:\DCOS\mesos\src\tests\mesos-tests.vcxproj]
         d:\dcos\mesos\mesos\src\tests\operation_reconciliation_tests.cpp(786): error C2039:
'call': is not a member of 'mesos::internal::tests::scheduler::TestMesos<mesos::v1::scheduler::Mesos,mesos::v1::scheduler::Event>'
[D:\DCOS\mesos\src\tests\mesos-tests.vcxproj]
         d:\dcos\mesos\mesos\src\tests\operation_reconciliation_tests.cpp(810): error C2039:
'call': is not a member of 'mesos::internal::tests::scheduler::TestMesos<mesos::v1::scheduler::Mesos,mesos::v1::scheduler::Event>'
[D:\DCOS\mesos\src\tests\mesos-tests.vcxproj]

    172 Warning(s)
    8 Error(s)

Time Elapsed 00:32:28.10
```

- Mesos Reviewbot Windows


On April 20, 2018, 10:54 p.m., Gaston Kleiman wrote:
> 
> -----------------------------------------------------------
> This is an automatically generated e-mail. To reply, visit:
> https://reviews.apache.org/r/66696/
> -----------------------------------------------------------
> 
> (Updated April 20, 2018, 10:54 p.m.)
> 
> 
> Review request for mesos and Greg Mann.
> 
> 
> Repository: mesos
> 
> 
> Description
> -------
> 
> Updated documentation for operation feedback.
> 
> 
> Diffs
> -----
> 
>   docs/csi.md 2d96ee754b3fdcfb18a7516f30abf0086fa75137 
>   docs/scheduler-http-api.md 3929c33781a152428338c4cdaf7dbc47da7c875e 
> 
> 
> Diff: https://reviews.apache.org/r/66696/diff/4/
> 
> 
> Testing
> -------
> 
> 
> Thanks,
> 
> Gaston Kleiman
> 
>


Mime
  • Unnamed multipart/alternative (inline, None, 0 bytes)
View raw message