mesos-reviews mailing list archives

Site index · List index
Message view « Date » · « Thread »
Top « Date » · « Thread »
From Mesos Reviewbot Windows <revi...@mesos.apache.org>
Subject Re: Review Request 66694: Updated the 1.6.0 CHANGELOG.
Date Wed, 18 Apr 2018 19:10:27 GMT

-----------------------------------------------------------
This is an automatically generated e-mail. To reply, visit:
https://reviews.apache.org/r/66694/#review201448
-----------------------------------------------------------



FAIL: Some of the unit tests failed. Please check the relevant logs.

Reviews applied: `['66694']`

Failed command: `Start-MesosCITesting`

All the build artifacts available at: http://dcos-win.westus.cloudapp.azure.com/mesos-build/review/66694

Relevant logs:

- [libprocess-tests-cmake-stdout.log](http://dcos-win.westus.cloudapp.azure.com/mesos-build/review/66694/logs/libprocess-tests-cmake-stdout.log):

```
         d:\dcos\mesos\3rdparty\libevent-2.1.5-beta\src\libevent-2.1.5-beta\evutil_time.c(499):
warning C4244: '=': conversion from 'int64_t' to 'long', possible loss of data [D:\DCOS\mesos\3rdparty\libevent-2.1.5-beta\src\libevent-2.1.5-beta-build\event_extra.vcxproj]
[D:\DCOS\mesos\3rdparty\libevent-2.1.5-beta.vcxproj]
         d:\dcos\mesos\3rdparty\libevent-2.1.5-beta\src\libevent-2.1.5-beta\evutil_time.c(504):
warning C4244: '=': conversion from 'time_t' to 'long', possible loss of data [D:\DCOS\mesos\3rdparty\libevent-2.1.5-beta\src\libevent-2.1.5-beta-build\event_extra.vcxproj]
[D:\DCOS\mesos\3rdparty\libevent-2.1.5-beta.vcxproj]
         d:\dcos\mesos\3rdparty\libevent-2.1.5-beta\src\libevent-2.1.5-beta\bufferevent_openssl.c(185):
warning C4267: '=': conversion from 'size_t' to 'int', possible loss of data [D:\DCOS\mesos\3rdparty\libevent-2.1.5-beta\src\libevent-2.1.5-beta-build\event_extra.vcxproj]
[D:\DCOS\mesos\3rdparty\libevent-2.1.5-beta.vcxproj]
         d:\dcos\mesos\3rdparty\libevent-2.1.5-beta\src\libevent-2.1.5-beta\bufferevent_openssl.c(230):
warning C4267: 'function': conversion from 'size_t' to 'int', possible loss of data [D:\DCOS\mesos\3rdparty\libevent-2.1.5-beta\src\libevent-2.1.5-beta-build\event_extra.vcxproj]
[D:\DCOS\mesos\3rdparty\libevent-2.1.5-beta.vcxproj]
         d:\dcos\mesos\3rdparty\libevent-2.1.5-beta\src\libevent-2.1.5-beta\bufferevent_openssl.c(587):
warning C4244: '=': conversion from 'SSIZE_T' to 'int', possible loss of data [D:\DCOS\mesos\3rdparty\libevent-2.1.5-beta\src\libevent-2.1.5-beta-build\event_extra.vcxproj]
[D:\DCOS\mesos\3rdparty\libevent-2.1.5-beta.vcxproj]
         d:\dcos\mesos\3rdparty\libevent-2.1.5-beta\src\libevent-2.1.5-beta\bufferevent_openssl.c(598):
warning C4267: 'function': conversion from 'size_t' to 'int', possible loss of data [D:\DCOS\mesos\3rdparty\libevent-2.1.5-beta\src\libevent-2.1.5-beta-build\event_extra.vcxproj]
[D:\DCOS\mesos\3rdparty\libevent-2.1.5-beta.vcxproj]
         d:\dcos\mesos\3rdparty\libevent-2.1.5-beta\src\libevent-2.1.5-beta\bufferevent_openssl.c(654):
warning C4244: '=': conversion from 'SSIZE_T' to 'int', possible loss of data [D:\DCOS\mesos\3rdparty\libevent-2.1.5-beta\src\libevent-2.1.5-beta-build\event_extra.vcxproj]
[D:\DCOS\mesos\3rdparty\libevent-2.1.5-beta.vcxproj]
         d:\dcos\mesos\3rdparty\libevent-2.1.5-beta\src\libevent-2.1.5-beta\bufferevent_openssl.c(656):
warning C4244: '=': conversion from 'SSIZE_T' to 'int', possible loss of data [D:\DCOS\mesos\3rdparty\libevent-2.1.5-beta\src\libevent-2.1.5-beta-build\event_extra.vcxproj]
[D:\DCOS\mesos\3rdparty\libevent-2.1.5-beta.vcxproj]
         d:\dcos\mesos\3rdparty\libevent-2.1.5-beta\src\libevent-2.1.5-beta\bufferevent_openssl.c(675):
warning C4267: 'function': conversion from 'size_t' to 'int', possible loss of data [D:\DCOS\mesos\3rdparty\libevent-2.1.5-beta\src\libevent-2.1.5-beta-build\event_extra.vcxproj]
[D:\DCOS\mesos\3rdparty\libevent-2.1.5-beta.vcxproj]
         d:\dcos\mesos\3rdparty\libevent-2.1.5-beta\src\libevent-2.1.5-beta\bufferevent_openssl.c(755):
warning C4267: '=': conversion from 'size_t' to 'int', possible loss of data [D:\DCOS\mesos\3rdparty\libevent-2.1.5-beta\src\libevent-2.1.5-beta-build\event_extra.vcxproj]
[D:\DCOS\mesos\3rdparty\libevent-2.1.5-beta.vcxproj]
         d:\dcos\mesos\3rdparty\libevent-2.1.5-beta\src\libevent-2.1.5-beta\bufferevent_openssl.c(763):
warning C4244: '=': conversion from 'SSIZE_T' to 'int', possible loss of data [D:\DCOS\mesos\3rdparty\libevent-2.1.5-beta\src\libevent-2.1.5-beta-build\event_extra.vcxproj]
[D:\DCOS\mesos\3rdparty\libevent-2.1.5-beta.vcxproj]
         d:\dcos\mesos\3rdparty\libevent-2.1.5-beta\src\libevent-2.1.5-beta\bufferevent_openssl.c(874):
warning C4267: '=': conversion from 'size_t' to 'int', possible loss of data [D:\DCOS\mesos\3rdparty\libevent-2.1.5-beta\src\libevent-2.1.5-beta-build\event_extra.vcxproj]
[D:\DCOS\mesos\3rdparty\libevent-2.1.5-beta.vcxproj]
         d:\dcos\mesos\3rdparty\libevent-2.1.5-beta\src\libevent-2.1.5-beta\bufferevent_openssl.c(1275):
warning C4244: 'function': conversion from 'intptr_t' to 'int', possible loss of data [D:\DCOS\mesos\3rdparty\libevent-2.1.5-beta\src\libevent-2.1.5-beta-build\event_extra.vcxproj]
[D:\DCOS\mesos\3rdparty\libevent-2.1.5-beta.vcxproj]
         d:\dcos\mesos\3rdparty\libevent-2.1.5-beta\src\libevent-2.1.5-beta\bufferevent_openssl.c(1456):
warning C4244: 'function': conversion from 'intptr_t' to 'int', possible loss of data [D:\DCOS\mesos\3rdparty\libevent-2.1.5-beta\src\libevent-2.1.5-beta-build\event_extra.vcxproj]
[D:\DCOS\mesos\3rdparty\libevent-2.1.5-beta.vcxproj]
         d:\dcos\mesos\3rdparty\libevent-2.1.5-beta\src\libevent-2.1.5-beta\evdns.c(3792):
warning C4996: 'GetVersion': was declared deprecated [D:\DCOS\mesos\3rdparty\libevent-2.1.5-beta\src\libevent-2.1.5-beta-build\event_extra.vcxproj]
[D:\DCOS\mesos\3rdparty\libevent-2.1.5-beta.vcxproj]


       "D:\DCOS\mesos\3rdparty\libprocess\src\tests\libprocess-tests.vcxproj" (default target)
(1) ->
       "D:\DCOS\mesos\3rdparty\libprocess\src\process.vcxproj" (default target) (13) ->
       (ClCompile target) -> 
         d:\dcos\mesos\mesos\3rdparty\libprocess\src\memory_profiler.cpp(316): error C2280:
'Try<std::string,Error> os::shell<>(const std::string &)': attempting to reference
a deleted function [D:\DCOS\mesos\3rdparty\libprocess\src\process.vcxproj]
         d:\dcos\mesos\mesos\3rdparty\libprocess\src\memory_profiler.cpp(1105): error C2039:
'write': is not a member of 'os' [D:\DCOS\mesos\3rdparty\libprocess\src\process.vcxproj]
         d:\dcos\mesos\mesos\3rdparty\libprocess\src\memory_profiler.cpp(1105): error C2660:
'write': function does not take 2 arguments [D:\DCOS\mesos\3rdparty\libprocess\src\process.vcxproj]
         d:\dcos\mesos\mesos\3rdparty\libprocess\src\memory_profiler.cpp(1105): error C2512:
'Try<Nothing,Error>': no appropriate default constructor available [D:\DCOS\mesos\3rdparty\libprocess\src\process.vcxproj]

    112 Warning(s)
    4 Error(s)

Time Elapsed 00:05:04.65
```

- [mesos-tests-cmake-stdout.log](http://dcos-win.westus.cloudapp.azure.com/mesos-build/review/66694/logs/mesos-tests-cmake-stdout.log):

```
         d:\dcos\mesos\3rdparty\zookeeper-3.4.8\src\zookeeper-3.4.8\src\c\src\recordio.c(170):
warning C4267: '=': conversion from 'size_t' to 'int32_t', possible loss of data [D:\DCOS\mesos\3rdparty\zookeeper-3.4.8\src\zookeeper-3.4.8-build\zookeeper.vcxproj]
[D:\DCOS\mesos\3rdparty\zookeeper-3.4.8.vcxproj]
         d:\dcos\mesos\3rdparty\zookeeper-3.4.8\src\zookeeper-3.4.8\src\c\src\mt_adaptor.c(496):
warning C4244: '=': conversion from 'time_t' to 'int32_t', possible loss of data [D:\DCOS\mesos\3rdparty\zookeeper-3.4.8\src\zookeeper-3.4.8-build\zookeeper.vcxproj]
[D:\DCOS\mesos\3rdparty\zookeeper-3.4.8.vcxproj]
         d:\dcos\mesos\3rdparty\zookeeper-3.4.8\src\zookeeper-3.4.8\src\c\src\winport.c(256):
warning C4090: 'function': different 'const' qualifiers [D:\DCOS\mesos\3rdparty\zookeeper-3.4.8\src\zookeeper-3.4.8-build\zookeeper.vcxproj]
[D:\DCOS\mesos\3rdparty\zookeeper-3.4.8.vcxproj]
         d:\dcos\mesos\3rdparty\zookeeper-3.4.8\src\zookeeper-3.4.8\src\c\src\winport.c(166):
warning C4716: 'pthread_cond_broadcast': must return a value [D:\DCOS\mesos\3rdparty\zookeeper-3.4.8\src\zookeeper-3.4.8-build\zookeeper.vcxproj]
[D:\DCOS\mesos\3rdparty\zookeeper-3.4.8.vcxproj]
         d:\dcos\mesos\3rdparty\zookeeper-3.4.8\src\zookeeper-3.4.8\src\c\src\winport.c(205):
warning C4716: 'pthread_cond_wait': must return a value [D:\DCOS\mesos\3rdparty\zookeeper-3.4.8\src\zookeeper-3.4.8-build\zookeeper.vcxproj]
[D:\DCOS\mesos\3rdparty\zookeeper-3.4.8.vcxproj]
         d:\dcos\mesos\3rdparty\zookeeper-3.4.8\src\zookeeper-3.4.8\src\c\src\cli.c(124):
warning C4996: 'fopen': This function or variable may be unsafe. Consider using fopen_s instead.
To disable deprecation, use _CRT_SECURE_NO_WARNINGS. See online help for details. [D:\DCOS\mesos\3rdparty\zookeeper-3.4.8\src\zookeeper-3.4.8-build\cli.vcxproj]
[D:\DCOS\mesos\3rdparty\zookeeper-3.4.8.vcxproj]
         d:\dcos\mesos\3rdparty\zookeeper-3.4.8\src\zookeeper-3.4.8\src\c\src\cli.c(128):
warning C4267: 'initializing': conversion from 'size_t' to 'int', possible loss of data [D:\DCOS\mesos\3rdparty\zookeeper-3.4.8\src\zookeeper-3.4.8-build\cli.vcxproj]
[D:\DCOS\mesos\3rdparty\zookeeper-3.4.8.vcxproj]
         d:\dcos\mesos\3rdparty\zookeeper-3.4.8\src\zookeeper-3.4.8\src\c\src\cli.c(279):
warning C4267: 'function': conversion from 'size_t' to 'int', possible loss of data [D:\DCOS\mesos\3rdparty\zookeeper-3.4.8\src\zookeeper-3.4.8-build\cli.vcxproj]
[D:\DCOS\mesos\3rdparty\zookeeper-3.4.8.vcxproj]
         d:\dcos\mesos\3rdparty\zookeeper-3.4.8\src\zookeeper-3.4.8\src\c\src\cli.c(301):
warning C4267: 'initializing': conversion from 'size_t' to 'int', possible loss of data [D:\DCOS\mesos\3rdparty\zookeeper-3.4.8\src\zookeeper-3.4.8-build\cli.vcxproj]
[D:\DCOS\mesos\3rdparty\zookeeper-3.4.8.vcxproj]
         d:\dcos\mesos\3rdparty\zookeeper-3.4.8\src\zookeeper-3.4.8\src\c\src\cli.c(368):
warning C4267: 'function': conversion from 'size_t' to 'int', possible loss of data [D:\DCOS\mesos\3rdparty\zookeeper-3.4.8\src\zookeeper-3.4.8-build\cli.vcxproj]
[D:\DCOS\mesos\3rdparty\zookeeper-3.4.8.vcxproj]
         d:\dcos\mesos\3rdparty\zookeeper-3.4.8\src\zookeeper-3.4.8\src\c\src\cli.c(372):
warning C4267: 'function': conversion from 'size_t' to 'int', possible loss of data [D:\DCOS\mesos\3rdparty\zookeeper-3.4.8\src\zookeeper-3.4.8-build\cli.vcxproj]
[D:\DCOS\mesos\3rdparty\zookeeper-3.4.8.vcxproj]
         d:\dcos\mesos\3rdparty\zookeeper-3.4.8\src\zookeeper-3.4.8\src\c\src\cli.c(512):
warning C4267: 'function': conversion from 'size_t' to 'int', possible loss of data [D:\DCOS\mesos\3rdparty\zookeeper-3.4.8\src\zookeeper-3.4.8-build\cli.vcxproj]
[D:\DCOS\mesos\3rdparty\zookeeper-3.4.8.vcxproj]
         d:\dcos\mesos\3rdparty\zookeeper-3.4.8\src\zookeeper-3.4.8\src\c\src\cli.c(543):
warning C4996: 'strcpy': This function or variable may be unsafe. Consider using strcpy_s
instead. To disable deprecation, use _CRT_SECURE_NO_WARNINGS. See online help for details.
[D:\DCOS\mesos\3rdparty\zookeeper-3.4.8\src\zookeeper-3.4.8-build\cli.vcxproj] [D:\DCOS\mesos\3rdparty\zookeeper-3.4.8.vcxproj]
         d:\dcos\mesos\3rdparty\zookeeper-3.4.8\src\zookeeper-3.4.8\src\c\src\cli.c(548):
warning C4996: 'fopen': This function or variable may be unsafe. Consider using fopen_s instead.
To disable deprecation, use _CRT_SECURE_NO_WARNINGS. See online help for details. [D:\DCOS\mesos\3rdparty\zookeeper-3.4.8\src\zookeeper-3.4.8-build\cli.vcxproj]
[D:\DCOS\mesos\3rdparty\zookeeper-3.4.8.vcxproj]
         d:\dcos\mesos\3rdparty\zookeeper-3.4.8\src\zookeeper-3.4.8\src\c\src\cli.c(569):
warning C4996: 'strcpy': This function or variable may be unsafe. Consider using strcpy_s
instead. To disable deprecation, use _CRT_SECURE_NO_WARNINGS. See online help for details.
[D:\DCOS\mesos\3rdparty\zookeeper-3.4.8\src\zookeeper-3.4.8-build\cli.vcxproj] [D:\DCOS\mesos\3rdparty\zookeeper-3.4.8.vcxproj]


       "D:\DCOS\mesos\src\tests\mesos-tests.vcxproj" (default target) (1) ->
       "D:\DCOS\mesos\3rdparty\libprocess\src\process.vcxproj" (default target) (14) ->
       (ClCompile target) -> 
         d:\dcos\mesos\mesos\3rdparty\libprocess\src\memory_profiler.cpp(316): error C2280:
'Try<std::string,Error> os::shell<>(const std::string &)': attempting to reference
a deleted function [D:\DCOS\mesos\3rdparty\libprocess\src\process.vcxproj]
         d:\dcos\mesos\mesos\3rdparty\libprocess\src\memory_profiler.cpp(1105): error C2039:
'write': is not a member of 'os' [D:\DCOS\mesos\3rdparty\libprocess\src\process.vcxproj]
         d:\dcos\mesos\mesos\3rdparty\libprocess\src\memory_profiler.cpp(1105): error C2660:
'write': function does not take 2 arguments [D:\DCOS\mesos\3rdparty\libprocess\src\process.vcxproj]
         d:\dcos\mesos\mesos\3rdparty\libprocess\src\memory_profiler.cpp(1105): error C2512:
'Try<Nothing,Error>': no appropriate default constructor available [D:\DCOS\mesos\3rdparty\libprocess\src\process.vcxproj]

    172 Warning(s)
    4 Error(s)

Time Elapsed 00:06:59.93
```

- Mesos Reviewbot Windows


On April 18, 2018, 2:45 p.m., Greg Mann wrote:
> 
> -----------------------------------------------------------
> This is an automatically generated e-mail. To reply, visit:
> https://reviews.apache.org/r/66694/
> -----------------------------------------------------------
> 
> (Updated April 18, 2018, 2:45 p.m.)
> 
> 
> Review request for mesos, Alexander Rukletsov, Andrew Schwartzmeyer, Alexander Rojas,
Benjamin Bannier, and James Peach.
> 
> 
> Repository: mesos
> 
> 
> Description
> -------
> 
> Updated the 1.6.0 CHANGELOG.
> 
> 
> Diffs
> -----
> 
>   CHANGELOG 09fff1d50504de158b6c77f51bd7968746e31371 
> 
> 
> Diff: https://reviews.apache.org/r/66694/diff/1/
> 
> 
> Testing
> -------
> 
> 
> Thanks,
> 
> Greg Mann
> 
>


Mime
  • Unnamed multipart/alternative (inline, None, 0 bytes)
View raw message