mesos-reviews mailing list archives

Site index · List index
Message view « Date » · « Thread »
Top « Date » · « Thread »
From Mesos Reviewbot Windows <revi...@mesos.apache.org>
Subject Re: Review Request 66468: Added tests for operation status reconciliation.
Date Tue, 10 Apr 2018 01:24:07 GMT

-----------------------------------------------------------
This is an automatically generated e-mail. To reply, visit:
https://reviews.apache.org/r/66468/#review200786
-----------------------------------------------------------



FAIL: Some of the unit tests failed. Please check the relevant logs.

Reviews applied: `['66458', '66459', '66460', '66461', '66489', '66462', '66463', '66464',
'66465', '66466', '66467', '66468']`

Failed command: `Start-MesosCITesting`

All the build artifacts available at: http://dcos-win.westus.cloudapp.azure.com/mesos-build/review/66468

Relevant logs:

- [mesos-tests-stdout.log](http://dcos-win.westus.cloudapp.azure.com/mesos-build/review/66468/logs/mesos-tests-stdout.log):

```
[----------] 9 tests from Endpoint/SlaveEndpointTest (1069 ms total)

[----------] 2 tests from ContainerizerType/DefaultContainerDNSFlagTest
[ RUN      ] ContainerizerType/DefaultContainerDNSFlagTest.ValidateFlag/0
[       OK ] ContainerizerType/DefaultContainerDNSFlagTest.ValidateFlag/0 (33 ms)
[ RUN      ] ContainerizerType/DefaultContainerDNSFlagTest.ValidateFlag/1
[       OK ] ContainerizerType/DefaultContainerDNSFlagTest.ValidateFlag/1 (38 ms)
[----------] 2 tests from ContainerizerType/DefaultContainerDNSFlagTest (73 ms total)

[----------] 1 test from IsolationFlag/CpuIsolatorTest
[ RUN      ] IsolationFlag/CpuIsolatorTest.ROOT_UserCpuUsage/0
[       OK ] IsolationFlag/CpuIsolatorTest.ROOT_UserCpuUsage/0 (824 ms)
[----------] 1 test from IsolationFlag/CpuIsolatorTest (848 ms total)

[----------] 1 test from IsolationFlag/MemoryIsolatorTest
[ RUN      ] IsolationFlag/MemoryIsolatorTest.ROOT_MemUsage/0
[       OK ] IsolationFlag/MemoryIsolatorTest.ROOT_MemUsage/0 (838 ms)
[----------] 1 test from IsolationFlag/MemoryIsolatorTest (866 ms total)

[----------] Global test environment tear-down
[==========] 968 tests from 95 test cases ran. (442285 ms total)
[  PASSED  ] 966 tests.
[  FAILED  ] 2 tests, listed below:
[  FAILED  ] ContentType/OperationReconciliationTest.UnknownOperationRecoveredAgent/0, where
GetParam() = application/x-protobuf
[  FAILED  ] ContentType/OperationReconciliationTest.UnknownOperationRecoveredAgent/1, where
GetParam() = application/json

 2 FAILED TESTS
  YOU HAVE 214 DISABLED TESTS

```

- [mesos-tests-stderr.log](http://dcos-win.westus.cloudapp.azure.com/mesos-build/review/66468/logs/mesos-tests-stderr.log):

```
I0410 01:23:52.161422 20352 slave.cpp:3973] Shutting down framework a9d6834a-7b1d-4da5-a375-3b7dcce77cc3-0000
I0410 01:23:52.161422 18052 master.cpp:10567] Updating the state of task 6fc1f90b-e426-4b3b-b7a2-2d4a9eed5c10
of framework a9d6834a-7b1d-4da5-a375-3b7dcce77cc3-0000 (latest state: TASK_KILLED, status
update state: TASK_KILLED)
I0410 01:23:52.161422 20352 slave.cpp:66I0410 01:23:51.968423 16500 exec.cpp:162] Version:
1.6.0
I0410 01:23:51.997421 19168 exec.cpp:236] Executor registered on agent a9d6834a-7b1d-4da5-a375-3b7dcce77cc3-S0
I0410 01:23:52.001416 20052 executor.cpp:177] Received SUBSCRIBED event
I0410 01:23:52.005412 20052 executor.cpp:181] Subscribed executor on winbldsrv-01.zq4gs31qjdiunm1ryi1452nvnh.dx.internal.cloudapp.net
I0410 01:23:52.008416 17552 executor.cpp:177] Received LAUNCH event
I0410 01:23:52.014408 17552 executor.cpp:649] Starting task 6fc1f90b-e426-4b3b-b7a2-2d4a9eed5c10
I0410 01:23:52.100420 17552 executor.cpp:484] Running 'D:\DCOS\mesos\src\mesos-containerizer.exe
launch <POSSIBLY-SENSITIVE-DATA>'
I0410 01:23:52.130422 17552 executor.cpp:662] Forked command at 11604
I0410 01:23:52.163411  2132 exec.cpp:445] Executor asked to shutdown
I0410 01:23:52.164407 17528 executor.cpp:177] Received SHUTDOWN event
I0410 01:23:52.164407 17528 executor.cpp:759] Shutting down
I0410 01:23:52.164407 17528 executor.cpp:869] Sending SIGTERM to process tree at pid 70] Shutting
down executor '6fc1f90b-e426-4b3b-b7a2-2d4a9eed5c10' of framework a9d6834a-7b1d-4da5-a375-3b7dcce77cc3-0000
at executor(1)@10.3.1.8:55152
I0410 01:23:52.163411 20352 slave.cpp:923] Agent terminating
W0410 01:23:52.163411 20352 slave.cpp:3969] Ignoring shutdown framework a9d6834a-7b1d-4da5-a375-3b7dcce77cc3-0000
because it is terminating
I0410 01:23:52.164407 18052 master.cpp:10666] Removing task 6fc1f90b-e426-4b3b-b7a2-2d4a9eed5c10
with resources cpus(allocated: *):4; mem(allocated: *):2048; disk(allocated: *):1024; ports(allocated:
*):[31000-32000] of framework a9d6834a-7b1d-4da5-a375-3b7dcce77cc3-0000 on agent a9d6834a-7b1d-4da5-a375-3b7dcce77cc3-S0
at slave(433)@10.3.1.8:55131 (winbldsrv-01.zq4gs31qjdiunm1ryi1452nvnh.dx.internal.cloudapp.net)
I0410 01:23:52.167402 19504 containerizer.cpp:2338] Destroying container 354c5c1e-c756-424f-8a47-609dc5a8e54d
in RUNNING state
I0410 01:23:52.167402 19504 containerizer.cpp:2952] Transitioning the state of container 354c5c1e-c756-424f-8a47-609dc5a8e54d
from RUNNING to DESTROYING
I0410 01:23:52.167402 18052 master.cpp:1295] Agent a9d6834a-7b1d-4da5-a375-3b7dcce77cc3-S0
at slave(433)@10.3.1.8:55131 (winbldsrv-01.zq4gs31qjdiunm1ryi1452nvnh.dx.internal.cloudapp.net)
disconnected
I0410 01:23:52.167402 18052 master.cpp:3286] Disconnecting agent a9d6834a-7b1d-4da5-a375-3b7dcce77cc3-S0
at slave(433)@10.3.1.8:55131 (winbldsrv-01.zq4gs31qjdiunm1ryi1452nvnh.dx.internal.cloudapp.net)
I0410 01:23:52.167402 18052 master.cpp:3305] Deactivating agent a9d6834a-7b1d-4da5-a375-3b7dcce77cc3-S0
at slave(433)@10.3.1.8:55131 (winbldsrv-01.zq4gs31qjdiunm1ryi1452nvnh.dx.internal.cloudapp.net)
I0410 01:23:52.168403 19776 hierarchical.cpp:344] Removed framework a9d6834a-7b1d-4da5-a375-3b7dcce77cc3-0000
I0410 01:23:52.168403 19776 hierarchical.cpp:766] Agent a9d6834a-7b1d-4da5-a375-3b7dcce77cc3-S0
deactivated
I0410 01:23:52.168403 19504 launcher.cpp:156] Asked to destroy container 354c5c1e-c756-424f-8a47-609dc5a8e54d
I0410 01:23:52.224964  6388 containerizer.cpp:2791] Container 354c5c1e-c756-424f-8a47-609dc5a8e54d
has exited
I0410 01:23:52.259477 18920 master.cpp:1137] Master terminating
I0410 01:23:52.261471 17380 hierarchical.cpp:609] Removed agent a9d6834a-7b1d-4da5-a375-3b7dcce77cc3-S0
I0410 01:23:52.726791 19732 process.cpp:929] Stopped the socket accept loop
```

- Mesos Reviewbot Windows


On April 10, 2018, 12:30 a.m., Gaston Kleiman wrote:
> 
> -----------------------------------------------------------
> This is an automatically generated e-mail. To reply, visit:
> https://reviews.apache.org/r/66468/
> -----------------------------------------------------------
> 
> (Updated April 10, 2018, 12:30 a.m.)
> 
> 
> Review request for mesos and Greg Mann.
> 
> 
> Repository: mesos
> 
> 
> Description
> -------
> 
> Added tests for operation status reconciliation.
> 
> 
> Diffs
> -----
> 
>   src/Makefile.am 9f4b6d369a23af337e2384e52e3e41f4017df38a 
>   src/tests/CMakeLists.txt ade5180f6e072112ad4836aa436e8545260d2ae6 
>   src/tests/operation_reconciliation_tests.cpp PRE-CREATION 
>   src/tests/storage_local_resource_provider_tests.cpp 2872f1aec1a7b94fc302a533f5ae9e1be9658087

> 
> 
> Diff: https://reviews.apache.org/r/66468/diff/2/
> 
> 
> Testing
> -------
> 
> The new tests passed 1000 iterations on GNU/Linux.
> 
> 
> Thanks,
> 
> Gaston Kleiman
> 
>


Mime
  • Unnamed multipart/alternative (inline, None, 0 bytes)
View raw message