mesos-reviews mailing list archives

Site index · List index
Message view « Date » · « Thread »
Top « Date » · « Thread »
From Mesos Reviewbot Windows <revi...@mesos.apache.org>
Subject Re: Review Request 66468: Added tests for operation status reconciliation.
Date Mon, 09 Apr 2018 22:54:09 GMT

-----------------------------------------------------------
This is an automatically generated e-mail. To reply, visit:
https://reviews.apache.org/r/66468/#review200776
-----------------------------------------------------------



FAIL: Some of the unit tests failed. Please check the relevant logs.

Reviews applied: `['66458', '66459', '66460', '66461', '66489', '66462', '66463', '66464',
'66465', '66466', '66467', '66468']`

Failed command: `Start-MesosCITesting`

All the build artifacts available at: http://dcos-win.westus.cloudapp.azure.com/mesos-build/review/66468

Relevant logs:

- [mesos-tests-stdout.log](http://dcos-win.westus.cloudapp.azure.com/mesos-build/review/66468/logs/mesos-tests-stdout.log):

```
[----------] 9 tests from Endpoint/SlaveEndpointTest (1075 ms total)

[----------] 2 tests from ContainerizerType/DefaultContainerDNSFlagTest
[ RUN      ] ContainerizerType/DefaultContainerDNSFlagTest.ValidateFlag/0
[       OK ] ContainerizerType/DefaultContainerDNSFlagTest.ValidateFlag/0 (34 ms)
[ RUN      ] ContainerizerType/DefaultContainerDNSFlagTest.ValidateFlag/1
[       OK ] ContainerizerType/DefaultContainerDNSFlagTest.ValidateFlag/1 (39 ms)
[----------] 2 tests from ContainerizerType/DefaultContainerDNSFlagTest (76 ms total)

[----------] 1 test from IsolationFlag/CpuIsolatorTest
[ RUN      ] IsolationFlag/CpuIsolatorTest.ROOT_UserCpuUsage/0
[       OK ] IsolationFlag/CpuIsolatorTest.ROOT_UserCpuUsage/0 (794 ms)
[----------] 1 test from IsolationFlag/CpuIsolatorTest (820 ms total)

[----------] 1 test from IsolationFlag/MemoryIsolatorTest
[ RUN      ] IsolationFlag/MemoryIsolatorTest.ROOT_MemUsage/0
[       OK ] IsolationFlag/MemoryIsolatorTest.ROOT_MemUsage/0 (839 ms)
[----------] 1 test from IsolationFlag/MemoryIsolatorTest (866 ms total)

[----------] Global test environment tear-down
[==========] 970 tests from 95 test cases ran. (442741 ms total)
[  PASSED  ] 968 tests.
[  FAILED  ] 2 tests, listed below:
[  FAILED  ] ContentType/OperationReconciliationTest.UnknownOperationRecoveredAgent/0, where
GetParam() = application/x-protobuf
[  FAILED  ] ContentType/OperationReconciliationTest.UnknownOperationRecoveredAgent/1, where
GetParam() = application/json

 2 FAILED TESTS
  YOU HAVE 214 DISABLED TESTS

```

- [mesos-tests-stderr.log](http://dcos-win.westus.cloudapp.azure.com/mesos-build/review/66468/logs/mesos-tests-stderr.log):

```
I0409 22:53:54.540514 13084 master.cpp:10567] Updating the state of task 12d7222e-17b7-4f6c-b3e8-3d041a5736e6
of framework b43029a8-bf67-4974-b76e-b57534b9debd-0000 (latest state: TASK_KILLED, status
update state: TASK_KILLED)
I0409 22:53:54.540514 18280 slave.cpp:3973] Shutting down framework b43029a8-bf67-4974-b76e-b57534b9debd-0000
I0409 22:53:54.540514 18280 slave.cpp:6670] Shutting down executor '12d7222e-17b7-4f6c-b3e8-3d041a5736e6'
of framework b43029a8-bf67-4974-b76e-b57534b9debd-0000 at executor(1)@10.3.1.8:52653
I0409 22:53:54.541523 18280 slaI0409 22:53:54.303508 16996 exec.cpp:162] Version: 1.6.0
I0409 22:53:54.328505 12344 exec.cpp:236] Executor registered on agent b43029a8-bf67-4974-b76e-b57534b9debd-S0
I0409 22:53:54.332504 18756 executor.cpp:177] Received SUBSCRIBED event
I0409 22:53:54.339509 18756 executor.cpp:181] Subscribed executor on winbldsrv-01.zq4gs31qjdiunm1ryi1452nvnh.dx.internal.cloudapp.net
I0409 22:53:54.340507 18756 executor.cpp:177] Received LAUNCH event
I0409 22:53:54.346516 18756 executor.cpp:649] Starting task 12d7222e-17b7-4f6c-b3e8-3d041a5736e6
I0409 22:53:54.473526 18756 executor.cpp:484] Running 'D:\DCOS\mesos\src\mesos-containerizer.exe
launch <POSSIBLY-SENSITIVE-DATA>'
I0409 22:53:54.509528 18756 executor.cpp:662] Forked command at 17840
I0409 22:53:54.542521  8524 exec.cpp:445] Executor asked to shutdown
I0409 22:53:54.543520  3916 executor.cpp:177] Received SHUTDOWN event
I0409 22:53:54.543520  3916 executor.cpp:759] Shutting down
I0409 22:53:54.543520  3916 executor.cpp:869] Sending SIGTERM to process tree at pid ve.cpp:923]
Agent terminating
W0409 22:53:54.542521 18280 slave.cpp:3969] Ignoring shutdown framework b43029a8-bf67-4974-b76e-b57534b9debd-0000
because it is terminating
I0409 22:53:54.542521 13084 master.cpp:10666] Removing task 12d7222e-17b7-4f6c-b3e8-3d041a5736e6
with resources cpus(allocated: *):4; mem(allocated: *):2048; disk(allocated: *):1024; ports(allocated:
*):[31000-32000] of framework b43029a8-bf67-4974-b76e-b57534b9debd-0000 on agent b43029a8-bf67-4974-b76e-b57534b9debd-S0
at slave(435)@10.3.1.8:52632 (winbldsrv-01.zq4gs31qjdiunm1ryi1452nvnh.dx.internal.cloudapp.net)
I0409 22:53:54.545518 13084 master.cpp:1295] Agent b43029a8-bf67-4974-b76e-b57534b9debd-S0
at slave(435)@10.3.1.8:52632 (winbldsrv-01.zq4gs31qjdiunm1ryi1452nvnh.dx.internal.cloudapp.net)
disconnected
I0409 22:53:54.545518  9556 containerizer.cpp:2338] Destroying container cc397ac0-6831-429b-a581-aafb1ed597b6
in RUNNING state
I0409 22:53:54.545518 13084 master.cpp:3286] Disconnecting agent b43029a8-bf67-4974-b76e-b57534b9debd-S0
at slave(435)@10.3.1.8:52632 (winbldsrv-01.zq4gs31qjdiunm1ryi1452nvnh.dx.internal.cloudapp.net)
I0409 22:53:54.546533  9556 containerizer.cpp:2952] Transitioning the state of container cc397ac0-6831-429b-a581-aafb1ed597b6
from RUNNING to DESTROYING
I0409 22:53:54.546533 13084 master.cpp:3305] Deactivating agent b43029a8-bf67-4974-b76e-b57534b9debd-S0
at slave(435)@10.3.1.8:52632 (winbldsrv-01.zq4gs31qjdiunm1ryi1452nvnh.dx.internal.cloudapp.net)
I0409 22:53:54.546533 19492 hierarchical.cpp:344] Removed framework b43029a8-bf67-4974-b76e-b57534b9debd-0000
I0409 22:53:54.547526 19492 hierarchical.cpp:766] Agent b43029a8-bf67-4974-b76e-b57534b9debd-S0
deactivated
I0409 22:53:54.547526  9556 launcher.cpp:156] Asked to destroy container cc397ac0-6831-429b-a581-aafb1ed597b6
I0409 22:53:54.603799 21432 containerizer.cpp:2791] Container cc397ac0-6831-429b-a581-aafb1ed597b6
has exited
I0409 22:53:54.637874 13772 master.cpp:1137] Master terminating
I0409 22:53:54.639875  9556 hierarchical.cpp:609] Removed agent b43029a8-bf67-4974-b76e-b57534b9debd-S0
I0409 22:53:55.147363 18192 process.cpp:929] Stopped the socket accept loop
```

- Mesos Reviewbot Windows


On April 9, 2018, 9:53 p.m., Gaston Kleiman wrote:
> 
> -----------------------------------------------------------
> This is an automatically generated e-mail. To reply, visit:
> https://reviews.apache.org/r/66468/
> -----------------------------------------------------------
> 
> (Updated April 9, 2018, 9:53 p.m.)
> 
> 
> Review request for mesos and Greg Mann.
> 
> 
> Repository: mesos
> 
> 
> Description
> -------
> 
> Added tests for operation status reconciliation.
> 
> 
> Diffs
> -----
> 
>   src/Makefile.am 9f4b6d369a23af337e2384e52e3e41f4017df38a 
>   src/tests/CMakeLists.txt ade5180f6e072112ad4836aa436e8545260d2ae6 
>   src/tests/operation_reconciliation_tests.cpp PRE-CREATION 
>   src/tests/storage_local_resource_provider_tests.cpp 2872f1aec1a7b94fc302a533f5ae9e1be9658087

> 
> 
> Diff: https://reviews.apache.org/r/66468/diff/1/
> 
> 
> Testing
> -------
> 
> The new tests passed 1000 iterations on GNU/Linux.
> 
> 
> Thanks,
> 
> Gaston Kleiman
> 
>


Mime
  • Unnamed multipart/alternative (inline, None, 0 bytes)
View raw message