mesos-reviews mailing list archives

Site index · List index
Message view « Date » · « Thread »
Top « Date » · « Thread »
From Mesos Reviewbot Windows <revi...@mesos.apache.org>
Subject Re: Review Request 66347: Added a test for killing executor during task launch.
Date Fri, 06 Apr 2018 01:52:53 GMT

-----------------------------------------------------------
This is an automatically generated e-mail. To reply, visit:
https://reviews.apache.org/r/66347/#review200612
-----------------------------------------------------------



FAIL: Some of the unit tests failed. Please check the relevant logs.

Reviews applied: `['66118', '66119', '66120', '65679', '66126', '66143', '66322', '66144',
'66346', '66145', '66178', '66323', '66347']`

Failed command: `Start-MesosCITesting`

All the build artifacts available at: http://dcos-win.westus.cloudapp.azure.com/mesos-build/review/66347

Relevant logs:

- [mesos-tests-stdout.log](http://dcos-win.westus.cloudapp.azure.com/mesos-build/review/66347/logs/mesos-tests-stdout.log):

```
[       OK ] Endpoint/SlaveEndpointTest.NoAuthorizer/2 (115 ms)
[----------] 9 tests from Endpoint/SlaveEndpointTest (1062 ms total)

[----------] 2 tests from ContainerizerType/DefaultContainerDNSFlagTest
[ RUN      ] ContainerizerType/DefaultContainerDNSFlagTest.ValidateFlag/0
[       OK ] ContainerizerType/DefaultContainerDNSFlagTest.ValidateFlag/0 (32 ms)
[ RUN      ] ContainerizerType/DefaultContainerDNSFlagTest.ValidateFlag/1
[       OK ] ContainerizerType/DefaultContainerDNSFlagTest.ValidateFlag/1 (37 ms)
[----------] 2 tests from ContainerizerType/DefaultContainerDNSFlagTest (70 ms total)

[----------] 1 test from IsolationFlag/CpuIsolatorTest
[ RUN      ] IsolationFlag/CpuIsolatorTest.ROOT_UserCpuUsage/0
[       OK ] IsolationFlag/CpuIsolatorTest.ROOT_UserCpuUsage/0 (837 ms)
[----------] 1 test from IsolationFlag/CpuIsolatorTest (863 ms total)

[----------] 1 test from IsolationFlag/MemoryIsolatorTest
[ RUN      ] IsolationFlag/MemoryIsolatorTest.ROOT_MemUsage/0
[       OK ] IsolationFlag/MemoryIsolatorTest.ROOT_MemUsage/0 (850 ms)
[----------] 1 test from IsolationFlag/MemoryIsolatorTest (880 ms total)

[----------] Global test environment tear-down
[==========] 954 tests from 94 test cases ran. (457967 ms total)
[  PASSED  ] 953 tests.
[  FAILED  ] 1 test, listed below:
[  FAILED  ] CommandExecutorCheckTest.CommandCheckTimeout

 1 FAILED TEST
  YOU HAVE 214 DISABLED TESTS

```

- [mesos-tests-stderr.log](http://dcos-win.westus.cloudapp.azure.com/mesos-build/review/66347/logs/mesos-tests-stderr.log):

```
I0406 01:52:38.213266 17376 master.cpp:10449] Updating the state of task 8202d585-8501-4f0f-af99-99d5221664e6
of framework 1ddd4bb7-0d3a-4b39-b079-7df7737e8013-0000 (latest state: TASK_KILLED, status
update state: TASK_KILLED)
I0406 01:52:38.213266 16828 slave.cpI0406 01:52:38.017261 16720 exec.cpp:162] Version: 1.6.0
I0406 01:52:38.046293 17060 exec.cpp:236] Executor registered on agent 1ddd4bb7-0d3a-4b39-b079-7df7737e8013-S0
I0406 01:52:38.050273 14888 executor.cpp:177] Received SUBSCRIBED event
I0406 01:52:38.056270 14888 executor.cpp:181] Subscribed executor on winbldsrv-01.zq4gs31qjdiunm1ryi1452nvnh.dx.internal.cloudapp.net
I0406 01:52:38.056270 14888 executor.cpp:177] Received LAUNCH event
I0406 01:52:38.061272 14888 executor.cpp:649] Starting task 8202d585-8501-4f0f-af99-99d5221664e6
I0406 01:52:38.152279 14888 executor.cpp:484] Running 'D:\DCOS\mesos\src\mesos-containerizer.exe
launch <POSSIBLY-SENSITIVE-DATA>'
I0406 01:52:38.182284 14888 executor.cpp:662] Forked command at 9260
I0406 01:52:38.215266  6556 exec.cpp:445] Executor asked to shutdown
I0406 01:52:38.216271 13664 executor.cpp:177] Received SHUTDOWN event
I0406 01:52:38.216271 13664 executor.cpp:759] Shutting down
I0406 01:52:38.216271 13664 executor.cpp:869] Sending SIGTERM to process tree at pid 9p:3973]
Shutting down framework 1ddd4bb7-0d3a-4b39-b079-7df7737e8013-0000
I0406 01:52:38.213266 16828 slave.cpp:6670] Shutting down executor '8202d585-8501-4f0f-af99-99d5221664e6'
of framework 1ddd4bb7-0d3a-4b39-b079-7df7737e8013-0000 at executor(1)@10.3.1.8:56062
I0406 01:52:38.215266 16828 slave.cpp:923] Agent terminating
W0406 01:52:38.215266 16828 slave.cpp:3969] Ignoring shutdown framework 1ddd4bb7-0d3a-4b39-b079-7df7737e8013-0000
because it is terminating
I0406 01:52:38.215266 17376 master.cpp:10548] Removing task 8202d585-8501-4f0f-af99-99d5221664e6
with resources cpus(allocated: *):4; mem(allocated: *):2048; disk(allocated: *):1024; ports(allocated:
*):[31000-32000] of framework 1ddd4bb7-0d3a-4b39-b079-7df7737e8013-0000 on agent 1ddd4bb7-0d3a-4b39-b079-7df7737e8013-S0
at slave(423)@10.3.1.8:56040 (winbldsrv-01.zq4gs31qjdiunm1ryi1452nvnh.dx.internal.cloudapp.net)
I0406 01:52:38.219265 14112 containerizer.cpp:2338] Destroying container 87759137-6927-42c9-8034-edf3b40308a4
in RUNNING state
I0406 01:52:38.219265 17376 master.cpp:1295] Agent 1ddd4bb7-0d3a-4b39-b079-7df7737e8013-S0
at slave(423)@10.3.1.8:56040 (winbldsrv-01.zq4gs31qjdiunm1ryi1452nvnh.dx.internal.cloudapp.net)
disconnected
I0406 01:52:38.219265 14112 containerizer.cpp:2952] Transitioning the state of container 87759137-6927-42c9-8034-edf3b40308a4
from RUNNING to DESTROYING
I0406 01:52:38.219265 17376 master.cpp:3286] Disconnecting agent 1ddd4bb7-0d3a-4b39-b079-7df7737e8013-S0
at slave(423)@10.3.1.8:56040 (winbldsrv-01.zq4gs31qjdiunm1ryi1452nvnh.dx.internal.cloudapp.net)
I0406 01:52:38.220269 17376 master.cpp:3305] Deactivating agent 1ddd4bb7-0d3a-4b39-b079-7df7737e8013-S0
at slave(423)@10.3.1.8:56040 (winbldsrv-01.zq4gs31qjdiunm1ryi1452nvnh.dx.internal.cloudapp.net)
I0406 01:52:38.220269 12760 hierarchical.cpp:344] Removed framework 1ddd4bb7-0d3a-4b39-b079-7df7737e8013-0000
I0406 01:52:38.220269 12760 hierarchical.cpp:766] Agent 1ddd4bb7-0d3a-4b39-b079-7df7737e8013-S0
deactivated
I0406 01:52:38.220269 14112 launcher.cpp:156] Asked to destroy container 87759137-6927-42c9-8034-edf3b40308a4
I0406 01:52:38.330570 14900 containerizer.cpp:2791] Container 87759137-6927-42c9-8034-edf3b40308a4
has exited
I0406 01:52:38.363550 15212 master.cpp:1137] Master terminating
I0406 01:52:38.365535  3812 hierarchical.cpp:609] Removed agent 1ddd4bb7-0d3a-4b39-b079-7df7737e8013-S0
I0406 01:52:38.863575 14436 process.cpp:929] Stopped the socket accept loop
```

- Mesos Reviewbot Windows


On April 6, 2018, 12:37 a.m., Meng Zhu wrote:
> 
> -----------------------------------------------------------
> This is an automatically generated e-mail. To reply, visit:
> https://reviews.apache.org/r/66347/
> -----------------------------------------------------------
> 
> (Updated April 6, 2018, 12:37 a.m.)
> 
> 
> Review request for mesos and Greg Mann.
> 
> 
> Bugs: MESOS-8617 and MESOS-8624
>     https://issues.apache.org/jira/browse/MESOS-8617
>     https://issues.apache.org/jira/browse/MESOS-8624
> 
> 
> Repository: mesos
> 
> 
> Description
> -------
> 
> This test verifies that when agent shuts down a running
> executor, launching tasks on the agent that use the same
> executor will be dropped properly.
> 
> 
> Diffs
> -----
> 
>   src/tests/slave_tests.cpp 0d7d9726ee39e4c588ea5eb8a54a73fbe1249353 
> 
> 
> Diff: https://reviews.apache.org/r/66347/diff/6/
> 
> 
> Testing
> -------
> 
> make check
> 
> 
> Thanks,
> 
> Meng Zhu
> 
>


Mime
  • Unnamed multipart/alternative (inline, None, 0 bytes)
View raw message