mesos-reviews mailing list archives

Site index · List index
Message view « Date » · « Thread »
Top « Date » · « Thread »
From Mesos Reviewbot Windows <revi...@mesos.apache.org>
Subject Re: Review Request 66392: Find sasl2 on non-Windows platforms before trying to link it.
Date Thu, 05 Apr 2018 19:45:12 GMT

-----------------------------------------------------------
This is an automatically generated e-mail. To reply, visit:
https://reviews.apache.org/r/66392/#review200562
-----------------------------------------------------------



FAIL: Some of the unit tests failed. Please check the relevant logs.

Reviews applied: `['66384', '66385', '66387', '66392']`

Failed command: `Start-MesosCITesting`

All the build artifacts available at: http://dcos-win.westus.cloudapp.azure.com/mesos-build/review/66392

Relevant logs:

- [mesos-tests-stdout.log](http://dcos-win.westus.cloudapp.azure.com/mesos-build/review/66392/logs/mesos-tests-stdout.log):

```
[       OK ] Endpoint/SlaveEndpointTest.NoAuthorizer/2 (116 ms)
[----------] 9 tests from Endpoint/SlaveEndpointTest (1101 ms total)

[----------] 2 tests from ContainerizerType/DefaultContainerDNSFlagTest
[ RUN      ] ContainerizerType/DefaultContainerDNSFlagTest.ValidateFlag/0
[       OK ] ContainerizerType/DefaultContainerDNSFlagTest.ValidateFlag/0 (31 ms)
[ RUN      ] ContainerizerType/DefaultContainerDNSFlagTest.ValidateFlag/1
[       OK ] ContainerizerType/DefaultContainerDNSFlagTest.ValidateFlag/1 (37 ms)
[----------] 2 tests from ContainerizerType/DefaultContainerDNSFlagTest (72 ms total)

[----------] 1 test from IsolationFlag/CpuIsolatorTest
[ RUN      ] IsolationFlag/CpuIsolatorTest.ROOT_UserCpuUsage/0
[       OK ] IsolationFlag/CpuIsolatorTest.ROOT_UserCpuUsage/0 (806 ms)
[----------] 1 test from IsolationFlag/CpuIsolatorTest (833 ms total)

[----------] 1 test from IsolationFlag/MemoryIsolatorTest
[ RUN      ] IsolationFlag/MemoryIsolatorTest.ROOT_MemUsage/0
[       OK ] IsolationFlag/MemoryIsolatorTest.ROOT_MemUsage/0 (736 ms)
[----------] 1 test from IsolationFlag/MemoryIsolatorTest (762 ms total)

[----------] Global test environment tear-down
[==========] 949 tests from 94 test cases ran. (451009 ms total)
[  PASSED  ] 948 tests.
[  FAILED  ] 1 test, listed below:
[  FAILED  ] CommandExecutorCheckTest.CommandCheckTimeout

 1 FAILED TEST
  YOU HAVE 214 DISABLED TESTS

```

- [mesos-tests-stderr.log](http://dcos-win.westus.cloudapp.azure.com/mesos-build/review/66392/logs/mesos-tests-stderr.log):

```
I0405 19:44:58.372272  9320 slave.cpp:3877] Shutting down framework 92271462-df09-48d2-8671-75f722fd2fb3-0000
I0405 19:44:58.372272  3620 master.cpp:10449] Updating the state of task d1f2deb2-6fa6-4976-8a65-d5b3e3c7b546
of framework 92271462-df09-48d2-8671-75f722fd2fb3-0000 (latest state: TASK_KILLED, status
update state: TASK_KILLED)
I0405 19:44:58.372272  9320 slave.cpp:6574] Shutting down executor 'd1f2deb2-6fa6-4976-8a65-d5b3e3c7b546'
of framework 92271462-df09-48d2-8671-75f722fd2fb3-0000 at executor(1)@10.3.1.8:49504
I040I0405 19:44:58.190281 10276 exec.cpp:162] Version: 1.6.0
I0405 19:44:58.215250 16356 exec.cpp:236] Executor registered on agent 92271462-df09-48d2-8671-75f722fd2fb3-S0
I0405 19:44:58.220269 16440 executor.cpp:176] Received SUBSCRIBED event
I0405 19:44:58.225286 16440 executor.cpp:180] Subscribed executor on winbldsrv-01.zq4gs31qjdiunm1ryi1452nvnh.dx.internal.cloudapp.net
I0405 19:44:58.226286 16440 executor.cpp:176] Received LAUNCH event
I0405 19:44:58.230286 16440 executor.cpp:648] Starting task d1f2deb2-6fa6-4976-8a65-d5b3e3c7b546
I0405 19:44:58.313284 16440 executor.cpp:483] Running 'D:\DCOS\mesos\src\mesos-containerizer.exe
launch <POSSIBLY-SENSITIVE-DATA>'
I0405 19:44:58.342264 16440 executor.cpp:661] Forked command at 5796
I0405 19:44:58.373265 17128 exec.cpp:445] Executor asked to shutdown
I0405 19:44:58.374266  8036 executor.cpp:176] Received SHUTDOWN event
I0405 19:44:58.374266  8036 executor.cpp:758] Shutting down
I0405 19:44:58.374266  8036 executor.cpp:868] Sending SIGTERM to process tree at pid 55 19:44:58.373265
 9320 slave.cpp:923] Agent terminating
W0405 19:44:58.374266  9320 slave.cpp:3873] Ignoring shutdown framework 92271462-df09-48d2-8671-75f722fd2fb3-0000
because it is terminating
I0405 19:44:58.375288  3620 master.cpp:10548] Removing task d1f2deb2-6fa6-4976-8a65-d5b3e3c7b546
with resources cpus(allocated: *):4; mem(allocated: *):2048; disk(allocated: *):1024; ports(allocated:
*):[31000-32000] of framework 92271462-df09-48d2-8671-75f722fd2fb3-0000 on agent 92271462-df09-48d2-8671-75f722fd2fb3-S0
at slave(418)@10.3.1.8:49483 (winbldsrv-01.zq4gs31qjdiunm1ryi1452nvnh.dx.internal.cloudapp.net)
I0405 19:44:58.377274  9320 containerizer.cpp:2338] Destroying container 126d3f41-81f9-4cc1-8e43-b0a1b015bafc
in RUNNING state
I0405 19:44:58.377274  9320 containerizer.cpp:2952] Transitioning the state of container 126d3f41-81f9-4cc1-8e43-b0a1b015bafc
from RUNNING to DESTROYING
I0405 19:44:58.377274  3620 master.cpp:1295] Agent 92271462-df09-48d2-8671-75f722fd2fb3-S0
at slave(418)@10.3.1.8:49483 (winbldsrv-01.zq4gs31qjdiunm1ryi1452nvnh.dx.internal.cloudapp.net)
disconnected
I0405 19:44:58.378263  9320 launcher.cpp:156] Asked to destroy container 126d3f41-81f9-4cc1-8e43-b0a1b015bafc
I0405 19:44:58.378263  3620 master.cpp:3286] Disconnecting agent 92271462-df09-48d2-8671-75f722fd2fb3-S0
at slave(418)@10.3.1.8:49483 (winbldsrv-01.zq4gs31qjdiunm1ryi1452nvnh.dx.internal.cloudapp.net)
I0405 19:44:58.378263  3620 master.cpp:3305] Deactivating agent 92271462-df09-48d2-8671-75f722fd2fb3-S0
at slave(418)@10.3.1.8:49483 (winbldsrv-01.zq4gs31qjdiunm1ryi1452nvnh.dx.internal.cloudapp.net)
I0405 19:44:58.379258 16196 hierarchical.cpp:344] Removed framework 92271462-df09-48d2-8671-75f722fd2fb3-0000
I0405 19:44:58.379258 16196 hierarchical.cpp:766] Agent 92271462-df09-48d2-8671-75f722fd2fb3-S0
deactivated
I0405 19:44:58.389293 11768 containerizer.cpp:2791] Container 126d3f41-81f9-4cc1-8e43-b0a1b015bafc
has exited
I0405 19:44:58.423290 11372 master.cpp:1137] Master terminating
I0405 19:44:58.425273  9320 hierarchical.cpp:609] Removed agent 92271462-df09-48d2-8671-75f722fd2fb3-S0
I0405 19:44:58.905288  8032 process.cpp:929] Stopped the socket accept loop
```

- Mesos Reviewbot Windows


On April 6, 2018, 12:11 a.m., David Forsythe wrote:
> 
> -----------------------------------------------------------
> This is an automatically generated e-mail. To reply, visit:
> https://reviews.apache.org/r/66392/
> -----------------------------------------------------------
> 
> (Updated April 6, 2018, 12:11 a.m.)
> 
> 
> Review request for mesos and Andrew Schwartzmeyer.
> 
> 
> Bugs: MESOS-4176
>     https://issues.apache.org/jira/browse/MESOS-4176
> 
> 
> Repository: mesos
> 
> 
> Description
> -------
> 
> Find sasl2 on non-Windows platforms before trying to link it.
> 
> 
> Diffs
> -----
> 
>   3rdparty/CMakeLists.txt 9d0fd552a15387754fb7a27256308ef8beb1e3ed 
> 
> 
> Diff: https://reviews.apache.org/r/66392/diff/4/
> 
> 
> Testing
> -------
> 
> make on FreeBSD
> 
> 
> Thanks,
> 
> David Forsythe
> 
>


Mime
  • Unnamed multipart/alternative (inline, None, 0 bytes)
View raw message