mesos-reviews mailing list archives

Site index · List index
Message view « Date » · « Thread »
Top « Date » · « Thread »
From Mesos Reviewbot Windows <revi...@mesos.apache.org>
Subject Re: Review Request 66412: Fixed flaky agent test.
Date Wed, 04 Apr 2018 21:45:17 GMT

-----------------------------------------------------------
This is an automatically generated e-mail. To reply, visit:
https://reviews.apache.org/r/66412/#review200501
-----------------------------------------------------------



FAIL: Some of the unit tests failed. Please check the relevant logs.

Reviews applied: `['66118', '66119', '66120', '65679', '66126', '66143', '66322', '66144',
'66346', '66145', '66178', '66323', '66347', '66412']`

Failed command: `Start-MesosCITesting`

All the build artifacts available at: http://dcos-win.westus.cloudapp.azure.com/mesos-build/review/66412

Relevant logs:

- [mesos-tests-stdout.log](http://dcos-win.westus.cloudapp.azure.com/mesos-build/review/66412/logs/mesos-tests-stdout.log):

```
[       OK ] Endpoint/SlaveEndpointTest.NoAuthorizer/2 (114 ms)
[----------] 9 tests from Endpoint/SlaveEndpointTest (1064 ms total)

[----------] 2 tests from ContainerizerType/DefaultContainerDNSFlagTest
[ RUN      ] ContainerizerType/DefaultContainerDNSFlagTest.ValidateFlag/0
[       OK ] ContainerizerType/DefaultContainerDNSFlagTest.ValidateFlag/0 (35 ms)
[ RUN      ] ContainerizerType/DefaultContainerDNSFlagTest.ValidateFlag/1
[       OK ] ContainerizerType/DefaultContainerDNSFlagTest.ValidateFlag/1 (39 ms)
[----------] 2 tests from ContainerizerType/DefaultContainerDNSFlagTest (75 ms total)

[----------] 1 test from IsolationFlag/CpuIsolatorTest
[ RUN      ] IsolationFlag/CpuIsolatorTest.ROOT_UserCpuUsage/0
[       OK ] IsolationFlag/CpuIsolatorTest.ROOT_UserCpuUsage/0 (828 ms)
[----------] 1 test from IsolationFlag/CpuIsolatorTest (855 ms total)

[----------] 1 test from IsolationFlag/MemoryIsolatorTest
[ RUN      ] IsolationFlag/MemoryIsolatorTest.ROOT_MemUsage/0
[       OK ] IsolationFlag/MemoryIsolatorTest.ROOT_MemUsage/0 (835 ms)
[----------] 1 test from IsolationFlag/MemoryIsolatorTest (863 ms total)

[----------] Global test environment tear-down
[==========] 954 tests from 94 test cases ran. (460261 ms total)
[  PASSED  ] 953 tests.
[  FAILED  ] 1 test, listed below:
[  FAILED  ] CommandExecutorCheckTest.CommandCheckTimeout

 1 FAILED TEST
  YOU HAVE 214 DISABLED TESTS

```

- [mesos-tests-stderr.log](http://dcos-win.westus.cloudapp.azure.com/mesos-build/review/66412/logs/mesos-tests-stderr.log):

```
I0404 21:45:02.832861  3888 slave.cpp:3973] Shutting down framework 99588c03-1f27-4200-bd45-625c406a3e02-0000
I0404 21:45:02.831858 14660 master.cpp:10449] Updating the sI0404 21:45:02.638871  6128 exec.cpp:162]
Version: 1.6.0
I0404 21:45:02.667873  4216 exec.cpp:236] Executor registered on agent 99588c03-1f27-4200-bd45-625c406a3e02-S0
I0404 21:45:02.671876  8072 executor.cpp:176] Received SUBSCRIBED event
I0404 21:45:02.676874  8072 executor.cpp:180] Subscribed executor on winbldsrv-01.zq4gs31qjdiunm1ryi1452nvnh.dx.internal.cloudapp.net
I0404 21:45:02.677875  8072 executor.cpp:176] Received LAUNCH event
I0404 21:45:02.682873  8072 executor.cpp:648] Starting task a295962d-4f4e-4599-bd8a-33f77efa1514
I0404 21:45:02.774873  8072 executor.cpp:483] Running 'D:\DCOS\mesos\src\mesos-containerizer.exe
launch <POSSIBLY-SENSITIVE-DATA>'
I0404 21:45:02.804880  8072 executor.cpp:661] Forked command at 7240
I0404 21:45:02.834880  5960 exec.cpp:445] Executor asked to shutdown
I0404 21:45:02.834880 11880 executor.cpp:176] Received SHUTDOWN event
I0404 21:45:02.834880 11880 executor.cpp:758] Shutting down
I0404 21:45:02.834880 11880 executor.cpp:868] Sending SIGTERM to process tree at pid 7tate
of task a295962d-4f4e-4599-bd8a-33f77efa1514 of framework 99588c03-1f27-4200-bd45-625c406a3e02-0000
(latest state: TASK_KILLED, status update state: TASK_KILLED)
I0404 21:45:02.832861  3888 slave.cpp:6670] Shutting down executor 'a295962d-4f4e-4599-bd8a-33f77efa1514'
of framework 99588c03-1f27-4200-bd45-625c406a3e02-0000 at executor(1)@10.3.1.8:55204
I0404 21:45:02.833878  3888 slave.cpp:923] Agent terminating
W0404 21:45:02.833878  3888 slave.cpp:3969] Ignoring shutdown framework 99588c03-1f27-4200-bd45-625c406a3e02-0000
because it is terminating
I0404 21:45:02.835871 14660 master.cpp:10548] Removing task a295962d-4f4e-4599-bd8a-33f77efa1514
with resources cpus(allocated: *):4; mem(allocated: *):2048; disk(allocated: *):1024; ports(allocated:
*):[31000-32000] of framework 99588c03-1f27-4200-bd45-625c406a3e02-0000 on agent 99588c03-1f27-4200-bd45-625c406a3e02-S0
at slave(423)@10.3.1.8:55183 (winbldsrv-01.zq4gs31qjdiunm1ryi1452nvnh.dx.internal.cloudapp.net)
I0404 21:45:02.837882  6484 containerizer.cpp:2338] Destroying container 52fc0a76-d8b3-4846-9ee9-8c22958172b6
in RUNNING state
I0404 21:45:02.837882 14660 master.cpp:1295] Agent 99588c03-1f27-4200-bd45-625c406a3e02-S0
at slave(423)@10.3.1.8:55183 (winbldsrv-01.zq4gs31qjdiunm1ryi1452nvnh.dx.internal.cloudapp.net)
disconnected
I0404 21:45:02.837882 14660 master.cpp:3286] Disconnecting agent 99588c03-1f27-4200-bd45-625c406a3e02-S0
at slave(423)@10.3.1.8:55183 (winbldsrv-01.zq4gs31qjdiunm1ryi1452nvnh.dx.internal.cloudapp.net)
I0404 21:45:02.838881  6484 containerizer.cpp:2952] Transitioning the state of container 52fc0a76-d8b3-4846-9ee9-8c22958172b6
from RUNNING to DESTROYING
I0404 21:45:02.838881 14660 master.cpp:3305] Deactivating agent 99588c03-1f27-4200-bd45-625c406a3e02-S0
at slave(423)@10.3.1.8:55183 (winbldsrv-01.zq4gs31qjdiunm1ryi1452nvnh.dx.internal.cloudapp.net)
I0404 21:45:02.838881 12644 hierarchical.cpp:344] Removed framework 99588c03-1f27-4200-bd45-625c406a3e02-0000
I0404 21:45:02.839882  6484 launcher.cpp:156] Asked to destroy container 52fc0a76-d8b3-4846-9ee9-8c22958172b6
I0404 21:45:02.839882 12644 hierarchical.cpp:766] Agent 99588c03-1f27-4200-bd45-625c406a3e02-S0
deactivated
I0404 21:45:02.928000  2128 containerizer.cpp:2791] Container 52fc0a76-d8b3-4846-9ee9-8c22958172b6
has exited
I0404 21:45:02.963997 10728 master.cpp:1137] Master terminating
I0404 21:45:02.967000  4140 hierarchical.cpp:609] Removed agent 99588c03-1f27-4200-bd45-625c406a3e02-S0
I0404 21:45:03.411011 10288 process.cpp:929] Stopped the socket accept loop
```

- Mesos Reviewbot Windows


On April 4, 2018, 7:23 p.m., Meng Zhu wrote:
> 
> -----------------------------------------------------------
> This is an automatically generated e-mail. To reply, visit:
> https://reviews.apache.org/r/66412/
> -----------------------------------------------------------
> 
> (Updated April 4, 2018, 7:23 p.m.)
> 
> 
> Review request for mesos and Greg Mann.
> 
> 
> Repository: mesos
> 
> 
> Description
> -------
> 
> In test `KillTaskGroupBetweenRunTaskParts`, added extra
> synchronization to ensure `unmocked__run` finishes before
> the test tear down. Added `AWAIT` calls in other
> tests that use dispatch calls to guard against potential
> similar issues.
> 
> Also updated all dispatch calls to capture by value to avoid
> potential races where the arguments might be destroyed
> while the dispatch call is still running.
> 
> 
> Diffs
> -----
> 
>   src/tests/slave_tests.cpp 0d7d9726ee39e4c588ea5eb8a54a73fbe1249353 
> 
> 
> Diff: https://reviews.apache.org/r/66412/diff/4/
> 
> 
> Testing
> -------
> 
> make check
> 
> 
> Thanks,
> 
> Meng Zhu
> 
>


Mime
  • Unnamed multipart/alternative (inline, None, 0 bytes)
View raw message