mesos-reviews mailing list archives

Site index · List index
Message view « Date » · « Thread »
Top « Date » · « Thread »
From Mesos Reviewbot Windows <revi...@mesos.apache.org>
Subject Re: Review Request 66454: Updated the documented release schedule.
Date Wed, 04 Apr 2018 19:59:31 GMT

-----------------------------------------------------------
This is an automatically generated e-mail. To reply, visit:
https://reviews.apache.org/r/66454/#review200476
-----------------------------------------------------------



FAIL: Some of the unit tests failed. Please check the relevant logs.

Reviews applied: `['66454']`

Failed command: `Start-MesosCITesting`

All the build artifacts available at: http://dcos-win.westus.cloudapp.azure.com/mesos-build/review/66454

Relevant logs:

- [mesos-tests-stdout.log](http://dcos-win.westus.cloudapp.azure.com/mesos-build/review/66454/logs/mesos-tests-stdout.log):

```
[       OK ] Endpoint/SlaveEndpointTest.NoAuthorizer/2 (113 ms)
[----------] 9 tests from Endpoint/SlaveEndpointTest (1062 ms total)

[----------] 2 tests from ContainerizerType/DefaultContainerDNSFlagTest
[ RUN      ] ContainerizerType/DefaultContainerDNSFlagTest.ValidateFlag/0
[       OK ] ContainerizerType/DefaultContainerDNSFlagTest.ValidateFlag/0 (37 ms)
[ RUN      ] ContainerizerType/DefaultContainerDNSFlagTest.ValidateFlag/1
[       OK ] ContainerizerType/DefaultContainerDNSFlagTest.ValidateFlag/1 (41 ms)
[----------] 2 tests from ContainerizerType/DefaultContainerDNSFlagTest (79 ms total)

[----------] 1 test from IsolationFlag/CpuIsolatorTest
[ RUN      ] IsolationFlag/CpuIsolatorTest.ROOT_UserCpuUsage/0
[       OK ] IsolationFlag/CpuIsolatorTest.ROOT_UserCpuUsage/0 (823 ms)
[----------] 1 test from IsolationFlag/CpuIsolatorTest (850 ms total)

[----------] 1 test from IsolationFlag/MemoryIsolatorTest
[ RUN      ] IsolationFlag/MemoryIsolatorTest.ROOT_MemUsage/0
[       OK ] IsolationFlag/MemoryIsolatorTest.ROOT_MemUsage/0 (841 ms)
[----------] 1 test from IsolationFlag/MemoryIsolatorTest (869 ms total)

[----------] Global test environment tear-down
[==========] 949 tests from 94 test cases ran. (443218 ms total)
[  PASSED  ] 948 tests.
[  FAILED  ] 1 test, listed below:
[  FAILED  ] CommandExecutorCheckTest.CommandCheckTimeout

 1 FAILED TEST
  YOU HAVE 214 DISABLED TESTS

```

- [mesos-tests-stderr.log](http://dcos-win.westus.cloudapp.azure.com/mesos-build/review/66454/logs/mesos-tests-stderr.log):

```
I0404 19:59:17.749002 13628 executor.cpp:176] Received SUBSCRIBED event
I0404 19:59:17.755000 13628 executor.cpp:180] Subscribed executor on winbldsrv-01.zq4gs31qjdiunm1ryi1452nvnh.dx.internal.cloudapp.net
I0404 19:59:17.756000 13628 executor.cpp:176] Received LAUNCH event
I0404 19:59:17.762661 13628 executor.cpp:648] Starting task 32556b66-2924-4874-97e5-3c0108bf89b8
I0404 19:59:17.889008 13628 executor.cpp:483] Running 'D:\DCOS\mesos\src\mesos-containerizer.exe
launch <POSSIBLY-SENSITIVE-DATA>'
I0404 19:59:17.919005 13628 executor.cpp:661] Forked command at 11172
I0404 19:59:17.954010 14988 exec.cpp:445] Executor asked to shutdown
I0404 19:59:17.955009 11320 executor.cpp:176] Received SHUTDOWN event
I0404 19:59:17.955009 11320 executor.cpp:758] Shutting down
I0404 19:59:17.955009 11320 executor.cpp:868] Sending SIGTERM to process tree at pid  master.cpp:3249]
Deactivating framework 62403817-bf35-4b6f-8033-0629b81293a1-0000 (default) at scheduler-a95fd462-e118-4329-8f00-feeda82a92c7@10.3.1.8:52669
I0404 19:59:17.951997 11796 hierarchical.cpp:405] Deactivated framework 62403817-bf35-4b6f-8033-0629b81293a1-0000
I0404 19:59:17.953012 10448 slave.cpp:3877] Shutting down framework 62403817-bf35-4b6f-8033-0629b81293a1-0000
I0404 19:59:17.953012 12136 master.cpp:10449] Updating the state of task 32556b66-2924-4874-97e5-3c0108bf89b8
of framework 62403817-bf35-4b6f-8033-0629b81293a1-0000 (latest state: TASK_KILLED, status
update state: TASK_KILLED)
I0404 19:59:17.953012 10448 slave.cpp:6574] Shutting down executor '32556b66-2924-4874-97e5-3c0108bf89b8'
of framework 62403817-bf35-4b6f-8033-0629b81293a1-0000 at executor(1)@10.3.1.8:52690
I0404 19:59:17.954010 10448 slave.cpp:923] Agent terminating
W0404 19:59:17.954010 10448 slave.cpp:3873] Ignoring shutdown framework 62403817-bf35-4b6f-8033-0629b81293a1-0000
because it is terminating
I0404 19:59:17.956007 12136 master.cpp:10548] Removing task 32556b66-2924-4874-97e5-3c0108bf89b8
with resources cpus(allocated: *):4; mem(allocated: *):2048; disk(allocated: *):1024; ports(allocated:
*):[31000-32000] of framework 62403817-bf35-4b6f-8033-0629b81293a1-0000 on agent 62403817-bf35-4b6f-8033-0629b81293a1-S0
at slave(418)@10.3.1.8:52669 (winbldsrv-01.zq4gs31qjdiunm1ryi1452nvnh.dx.internal.cloudapp.net)
I0404 19:59:17.958003 10696 containerizer.cpp:2338] Destroying container 2ba6103d-af3c-4fdb-b49a-7de61dea1fa2
in RUNNING state
I0404 19:59:17.958003 10696 containerizer.cpp:2952] Transitioning the state of container 2ba6103d-af3c-4fdb-b49a-7de61dea1fa2
from RUNNING to DESTROYING
I0404 19:59:17.959010 10696 launcher.cpp:156] Asked to destroy container 2ba6103d-af3c-4fdb-b49a-7de61dea1fa2
I0404 19:59:17.959010 12136 master.cpp:1295] Agent 62403817-bf35-4b6f-8033-0629b81293a1-S0
at slave(418)@10.3.1.8:52669 (winbldsrv-01.zq4gs31qjdiunm1ryi1452nvnh.dx.internal.cloudapp.net)
disconnected
I0404 19:59:17.959010 12136 master.cpp:3286] Disconnecting agent 62403817-bf35-4b6f-8033-0629b81293a1-S0
at slave(418)@10.3.1.8:52669 (winbldsrv-01.zq4gs31qjdiunm1ryi1452nvnh.dx.internal.cloudapp.net)
I0404 19:59:17.960007 10448 hierarchical.cpp:344] Removed framework 62403817-bf35-4b6f-8033-0629b81293a1-0000
I0404 19:59:17.960007 12136 master.cpp:3305] Deactivating agent 62403817-bf35-4b6f-8033-0629b81293a1-S0
at slave(418)@10.3.1.8:52669 (winbldsrv-01.zq4gs31qjdiunm1ryi1452nvnh.dx.internal.cloudapp.net)
I0404 19:59:17.961012 15136 hierarchical.cpp:766] Agent 62403817-bf35-4b6f-8033-0629b81293a1-S0
deactivated
I0404 19:59:18.000999 15196 containerizer.cpp:2791] Container 2ba6103d-af3c-4fdb-b49a-7de61dea1fa2
has exited
I0404 19:59:18.037009 11756 master.cpp:1137] Master terminating
I0404 19:59:18.039011  9320 hierarchical.cpp:609] Removed agent 62403817-bf35-4b6f-8033-0629b81293a1-S0
I0404 19:59:18.496031  8764 process.cpp:929] Stopped the socket accept loop
```

- Mesos Reviewbot Windows


On April 4, 2018, 6:48 p.m., Greg Mann wrote:
> 
> -----------------------------------------------------------
> This is an automatically generated e-mail. To reply, visit:
> https://reviews.apache.org/r/66454/
> -----------------------------------------------------------
> 
> (Updated April 4, 2018, 6:48 p.m.)
> 
> 
> Review request for mesos, Benjamin Mahler, Jie Yu, and Vinod Kone.
> 
> 
> Repository: mesos
> 
> 
> Description
> -------
> 
> Updated the documented release schedule.
> 
> 
> Diffs
> -----
> 
>   docs/versioning.md 70feb53d68e579a4ec7dd545648caa898cbbf6de 
> 
> 
> Diff: https://reviews.apache.org/r/66454/diff/1/
> 
> 
> Testing
> -------
> 
> 
> Thanks,
> 
> Greg Mann
> 
>


Mime
  • Unnamed multipart/alternative (inline, None, 0 bytes)
View raw message