mesos-reviews mailing list archives

Site index · List index
Message view « Date » · « Thread »
Top « Date » · « Thread »
From Mesos Reviewbot Windows <revi...@mesos.apache.org>
Subject Re: Review Request 66314: Fix 3rdparty build commands for FreeBSD.
Date Wed, 04 Apr 2018 15:34:44 GMT

-----------------------------------------------------------
This is an automatically generated e-mail. To reply, visit:
https://reviews.apache.org/r/66314/#review200458
-----------------------------------------------------------



FAIL: Some of the unit tests failed. Please check the relevant logs.

Reviews applied: `['66314']`

Failed command: `Start-MesosCITesting`

All the build artifacts available at: http://dcos-win.westus.cloudapp.azure.com/mesos-build/review/66314

Relevant logs:

- [mesos-tests-stdout.log](http://dcos-win.westus.cloudapp.azure.com/mesos-build/review/66314/logs/mesos-tests-stdout.log):

```
[       OK ] Endpoint/SlaveEndpointTest.NoAuthorizer/2 (114 ms)
[----------] 9 tests from Endpoint/SlaveEndpointTest (1071 ms total)

[----------] 2 tests from ContainerizerType/DefaultContainerDNSFlagTest
[ RUN      ] ContainerizerType/DefaultContainerDNSFlagTest.ValidateFlag/0
[       OK ] ContainerizerType/DefaultContainerDNSFlagTest.ValidateFlag/0 (34 ms)
[ RUN      ] ContainerizerType/DefaultContainerDNSFlagTest.ValidateFlag/1
[       OK ] ContainerizerType/DefaultContainerDNSFlagTest.ValidateFlag/1 (38 ms)
[----------] 2 tests from ContainerizerType/DefaultContainerDNSFlagTest (74 ms total)

[----------] 1 test from IsolationFlag/CpuIsolatorTest
[ RUN      ] IsolationFlag/CpuIsolatorTest.ROOT_UserCpuUsage/0
[       OK ] IsolationFlag/CpuIsolatorTest.ROOT_UserCpuUsage/0 (766 ms)
[----------] 1 test from IsolationFlag/CpuIsolatorTest (791 ms total)

[----------] 1 test from IsolationFlag/MemoryIsolatorTest
[ RUN      ] IsolationFlag/MemoryIsolatorTest.ROOT_MemUsage/0
[       OK ] IsolationFlag/MemoryIsolatorTest.ROOT_MemUsage/0 (842 ms)
[----------] 1 test from IsolationFlag/MemoryIsolatorTest (868 ms total)

[----------] Global test environment tear-down
[==========] 949 tests from 94 test cases ran. (457107 ms total)
[  PASSED  ] 948 tests.
[  FAILED  ] 1 test, listed below:
[  FAILED  ] CommandExecutorCheckTest.CommandCheckTimeout

 1 FAILED TEST
  YOU HAVE 214 DISABLED TESTS

```

- [mesos-tests-stderr.log](http://dcos-win.westus.cloudapp.azure.com/mesos-build/review/66314/logs/mesos-tests-stderr.log):

```
I0404 15:34:29.087707  4724 master.cpp:10449] Updating the state of task f2abc4a7-0333-48dd-aa68-31c49aa6cb80
of framework cd7c7eb7-a02d-457f-902d-bde2d9aebf5a-0000 (latest state: TASK_KILLED, status
update state: TASK_KILLED)
I0404 15:34:29.087707 11060 slave.cpp:3877] Shutting down framework cd7c7eb7-a02d-457f-902d-bde2d9aebf5a-0000
I0404 15:34:29.088703 11060 slave.cpp:6574] Shutting down executor 'f2abc4a7-0333-48dd-aa68-31c49aa6cb80'
of framework cd7c7eb7-a02d-457f-902d-bde2d9aebf5a-0000 at executor(1)@10.3.1.8:64287
I0404 15:34:29.088703 11060 slave.cpp:923] Agent terminating
W0404 15:34:29.089694 11060 slave.cpp:3873] Ignoring shutdown framework cd7c7eb7-a02d-457f-902d-bde2d9aebf5a-0000
because it is terminating
I0404 15:34:29.090912  4724 master.cpp:10548] Removing task f2abc4a7-0333-48dd-aa68-31c49aa6cb80
with resources cpus(allocated: *):4; mem(allocated: *):2048; disk(allocated: *):1024; ports(allocated:
*):[31000-32000] of framework cd7c7eb7-a02d-457f-902d-bde2d9aebf5a-0000 on agent cd7c7eb7-a02d-457f-902d-bde2d9aebf5a-S0
at slave(418)@1I0404 15:34:28.887692  8764 exec.cpp:162] Version: 1.6.0
I0404 15:34:28.916703  3848 exec.cpp:236] Executor registered on agent cd7c7eb7-a02d-457f-902d-bde2d9aebf5a-S0
I0404 15:34:28.920713 13524 executor.cpp:176] Received SUBSCRIBED event
I0404 15:34:28.926687 13524 executor.cpp:180] Subscribed executor on winbldsrv-01.zq4gs31qjdiunm1ryi1452nvnh.dx.internal.cloudapp.net
I0404 15:34:28.927688 13524 executor.cpp:176] Received LAUNCH event
I0404 15:34:28.933684 13524 executor.cpp:648] Starting task f2abc4a7-0333-48dd-aa68-31c49aa6cb80
I0404 15:34:29.029688 13524 executor.cpp:483] Running 'D:\DCOS\mesos\src\mesos-containerizer.exe
launch <POSSIBLY-SENSITIVE-DATA>'
I0404 15:34:29.057710 13524 executor.cpp:661] Forked command at 13908
I0404 15:34:29.089694  2304 exec.cpp:445] Executor asked to shutdown
I0404 15:34:29.090912 11452 executor.cpp:176] Received SHUTDOWN event
I0404 15:34:29.090912 11452 executor.cpp:758] Shutting down
I0404 15:34:29.091694 11452 executor.cpp:868] Sending SIGTERM to process tree at pid 0.3.1.8:64266
(winbldsrv-01.zq4gs31qjdiunm1ryi1452nvnh.dx.internal.cloudapp.net)
I0404 15:34:29.093690 14220 containerizer.cpp:2338] Destroying container c09116e7-f435-4624-afac-33f7e1746e84
in RUNNING state
I0404 15:34:29.093690 14220 containerizer.cpp:2952] Transitioning the state of container c09116e7-f435-4624-afac-33f7e1746e84
from RUNNING to DESTROYING
I0404 15:34:29.093690  4724 master.cpp:1295] Agent cd7c7eb7-a02d-457f-902d-bde2d9aebf5a-S0
at slave(418)@10.3.1.8:64266 (winbldsrv-01.zq4gs31qjdiunm1ryi1452nvnh.dx.internal.cloudapp.net)
disconnected
I0404 15:34:29.094696  4724 master.cpp:3286] Disconnecting agent cd7c7eb7-a02d-457f-902d-bde2d9aebf5a-S0
at slave(418)@10.3.1.8:64266 (winbldsrv-01.zq4gs31qjdiunm1ryi1452nvnh.dx.internal.cloudapp.net)
I0404 15:34:29.094696  4724 master.cpp:3305] Deactivating agent cd7c7eb7-a02d-457f-902d-bde2d9aebf5a-S0
at slave(418)@10.3.1.8:64266 (winbldsrv-01.zq4gs31qjdiunm1ryi1452nvnh.dx.internal.cloudapp.net)
I0404 15:34:29.094696 14220 launcher.cpp:156] Asked to destroy container c09116e7-f435-4624-afac-33f7e1746e84
I0404 15:34:29.094696  3984 hierarchical.cpp:344] Removed framework cd7c7eb7-a02d-457f-902d-bde2d9aebf5a-0000
I0404 15:34:29.095711  3984 hierarchical.cpp:766] Agent cd7c7eb7-a02d-457f-902d-bde2d9aebf5a-S0
deactivated
I0404 15:34:29.183912  5332 containerizer.cpp:2791] Container c09116e7-f435-4624-afac-33f7e1746e84
has exited
I0404 15:34:29.215920 14208 master.cpp:1137] Master terminating
I0404 15:34:29.218905 11060 hierarchical.cpp:609] Removed agent cd7c7eb7-a02d-457f-902d-bde2d9aebf5a-S0
I0404 15:34:29.649932 11536 process.cpp:929] Stopped the socket accept loop
```

- Mesos Reviewbot Windows


On April 4, 2018, 7:34 a.m., David Forsythe wrote:
> 
> -----------------------------------------------------------
> This is an automatically generated e-mail. To reply, visit:
> https://reviews.apache.org/r/66314/
> -----------------------------------------------------------
> 
> (Updated April 4, 2018, 7:34 a.m.)
> 
> 
> Review request for mesos, Andrew Schwartzmeyer and Benjamin Bannier.
> 
> 
> Bugs: MESOS-4176
>     https://issues.apache.org/jira/browse/MESOS-4176
> 
> 
> Repository: mesos
> 
> 
> Description
> -------
> 
> Fix 3rdparty build commands for FreeBSD.
> 
> 
> Diffs
> -----
> 
>   3rdparty/CMakeLists.txt 2b63b58f7d6a88c9986b746283dcfa79b7bcb270 
> 
> 
> Diff: https://reviews.apache.org/r/66314/diff/4/
> 
> 
> Testing
> -------
> 
> make on FreeBSD
> 
> 
> Thanks,
> 
> David Forsythe
> 
>


Mime
  • Unnamed multipart/alternative (inline, None, 0 bytes)
View raw message