mesos-reviews mailing list archives

Site index · List index
Message view « Date » · « Thread »
Top « Date » · « Thread »
From Mesos Reviewbot Windows <revi...@mesos.apache.org>
Subject Re: Review Request 66314: Fix 3rdparty build commands for FreeBSD.
Date Wed, 04 Apr 2018 08:24:23 GMT

-----------------------------------------------------------
This is an automatically generated e-mail. To reply, visit:
https://reviews.apache.org/r/66314/#review200441
-----------------------------------------------------------



FAIL: Some of the unit tests failed. Please check the relevant logs.

Reviews applied: `['66314']`

Failed command: `Start-MesosCITesting`

All the build artifacts available at: http://dcos-win.westus.cloudapp.azure.com/mesos-build/review/66314

Relevant logs:

- [mesos-tests-stdout.log](http://dcos-win.westus.cloudapp.azure.com/mesos-build/review/66314/logs/mesos-tests-stdout.log):

```
[       OK ] Endpoint/SlaveEndpointTest.NoAuthorizer/2 (113 ms)
[----------] 9 tests from Endpoint/SlaveEndpointTest (1074 ms total)

[----------] 2 tests from ContainerizerType/DefaultContainerDNSFlagTest
[ RUN      ] ContainerizerType/DefaultContainerDNSFlagTest.ValidateFlag/0
[       OK ] ContainerizerType/DefaultContainerDNSFlagTest.ValidateFlag/0 (33 ms)
[ RUN      ] ContainerizerType/DefaultContainerDNSFlagTest.ValidateFlag/1
[       OK ] ContainerizerType/DefaultContainerDNSFlagTest.ValidateFlag/1 (39 ms)
[----------] 2 tests from ContainerizerType/DefaultContainerDNSFlagTest (75 ms total)

[----------] 1 test from IsolationFlag/CpuIsolatorTest
[ RUN      ] IsolationFlag/CpuIsolatorTest.ROOT_UserCpuUsage/0
[       OK ] IsolationFlag/CpuIsolatorTest.ROOT_UserCpuUsage/0 (814 ms)
[----------] 1 test from IsolationFlag/CpuIsolatorTest (844 ms total)

[----------] 1 test from IsolationFlag/MemoryIsolatorTest
[ RUN      ] IsolationFlag/MemoryIsolatorTest.ROOT_MemUsage/0
[       OK ] IsolationFlag/MemoryIsolatorTest.ROOT_MemUsage/0 (817 ms)
[----------] 1 test from IsolationFlag/MemoryIsolatorTest (842 ms total)

[----------] Global test environment tear-down
[==========] 949 tests from 94 test cases ran. (444889 ms total)
[  PASSED  ] 948 tests.
[  FAILED  ] 1 test, listed below:
[  FAILED  ] CommandExecutorCheckTest.CommandCheckTimeout

 1 FAILED TEST
  YOU HAVE 214 DISABLED TESTS

```

- [mesos-tests-stderr.log](http://dcos-win.westus.cloudapp.azure.com/mesos-build/review/66314/logs/mesos-tests-stderr.log):

```
I0404 08:24:10.527199  2600 slave.cpp:3877] Shutting down framework d27be169-928d-44bf-b9cf-c0b66c4562f5-0000
I0404 08:24:10.527199  7224 master.cpp:10449] Updating the state of task af9512c0-aec1-4dd5-b047-2ec5fb30f3ba
of framework d27be169-928d-44bfI0404 08:24:10.344171  4216 exec.cpp:162] Version: 1.6.0
I0404 08:24:10.372175  5172 exec.cpp:236] Executor registered on agent d27be169-928d-44bf-b9cf-c0b66c4562f5-S0
I0404 08:24:10.376562 12312 executor.cpp:176] Received SUBSCRIBED event
I0404 08:24:10.381171 12312 executor.cpp:180] Subscribed executor on winbldsrv-01.zq4gs31qjdiunm1ryi1452nvnh.dx.internal.cloudapp.net
I0404 08:24:10.382174 12312 executor.cpp:176] Received LAUNCH event
I0404 08:24:10.387174 12312 executor.cpp:648] Starting task af9512c0-aec1-4dd5-b047-2ec5fb30f3ba
I0404 08:24:10.472184 12312 executor.cpp:483] Running 'D:\DCOS\mesos\src\mesos-containerizer.exe
launch <POSSIBLY-SENSITIVE-DATA>'
I0404 08:24:10.501168 12312 executor.cpp:661] Forked command at 12424
I0404 08:24:10.529147  4228 exec.cpp:445] Executor asked to shutdown
I0404 08:24:10.530145 13964 executor.cpp:176] Received SHUTDOWN event
I0404 08:24:10.530145 13964 executor.cpp:758] Shutting down
I0404 08:24:10.530145 13964 executor.cpp:868] Sending SIGTERM to process tree at pid -b9cf-c0b66c4562f5-0000
(latest state: TASK_KILLED, status update state: TASK_KILLED)
I0404 08:24:10.527199  2600 slave.cpp:6574] Shutting down executor 'af9512c0-aec1-4dd5-b047-2ec5fb30f3ba'
of framework d27be169-928d-44bf-b9cf-c0b66c4562f5-0000 at executor(1)@10.3.1.8:57096
I0404 08:24:10.529147  7600 slave.cpp:923] Agent terminating
W0404 08:24:10.529147  7600 slave.cpp:3873] Ignoring shutdown framework d27be169-928d-44bf-b9cf-c0b66c4562f5-0000
because it is terminating
I0404 08:24:10.530145  7224 master.cpp:10548] Removing task af9512c0-aec1-4dd5-b047-2ec5fb30f3ba
with resources cpus(allocated: *):4; mem(allocated: *):2048; disk(allocated: *):1024; ports(allocated:
*):[31000-32000] of framework d27be169-928d-44bf-b9cf-c0b66c4562f5-0000 on agent d27be169-928d-44bf-b9cf-c0b66c4562f5-S0
at slave(418)@10.3.1.8:57075 (winbldsrv-01.zq4gs31qjdiunm1ryi1452nvnh.dx.internal.cloudapp.net)
I0404 08:24:10.532155  1124 containerizer.cpp:2338] Destroying container f6b7afe2-2176-4991-a7fc-c15fecf99239
in RUNNING state
I0404 08:24:10.533147  1124 containerizer.cpp:2952] Transitioning the state of container f6b7afe2-2176-4991-a7fc-c15fecf99239
from RUNNING to DESTROYING
I0404 08:24:10.533147  7224 master.cpp:1295] Agent d27be169-928d-44bf-b9cf-c0b66c4562f5-S0
at slave(418)@10.3.1.8:57075 (winbldsrv-01.zq4gs31qjdiunm1ryi1452nvnh.dx.internal.cloudapp.net)
disconnected
I0404 08:24:10.533147  7224 master.cpp:3286] Disconnecting agent d27be169-928d-44bf-b9cf-c0b66c4562f5-S0
at slave(418)@10.3.1.8:57075 (winbldsrv-01.zq4gs31qjdiunm1ryi1452nvnh.dx.internal.cloudapp.net)
I0404 08:24:10.533147  7224 master.cpp:3305] Deactivating agent d27be169-928d-44bf-b9cf-c0b66c4562f5-S0
at slave(418)@10.3.1.8:57075 (winbldsrv-01.zq4gs31qjdiunm1ryi1452nvnh.dx.internal.cloudapp.net)
I0404 08:24:10.534162  1124 launcher.cpp:156] Asked to destroy container f6b7afe2-2176-4991-a7fc-c15fecf99239
I0404 08:24:10.534162  9416 hierarchical.cpp:344] Removed framework d27be169-928d-44bf-b9cf-c0b66c4562f5-0000
I0404 08:24:10.534162  9416 hierarchical.cpp:766] Agent d27be169-928d-44bf-b9cf-c0b66c4562f5-S0
deactivated
I0404 08:24:10.607146 13908 containerizer.cpp:2791] Container f6b7afe2-2176-4991-a7fc-c15fecf99239
has exited
I0404 08:24:10.641182  7600 master.cpp:1137] Master terminating
I0404 08:24:10.644150 11136 hierarchical.cpp:609] Removed agent d27be169-928d-44bf-b9cf-c0b66c4562f5-S0
I0404 08:24:11.055742 13004 process.cpp:929] Stopped the socket accept loop
```

- Mesos Reviewbot Windows


On April 4, 2018, 6:45 a.m., David Forsythe wrote:
> 
> -----------------------------------------------------------
> This is an automatically generated e-mail. To reply, visit:
> https://reviews.apache.org/r/66314/
> -----------------------------------------------------------
> 
> (Updated April 4, 2018, 6:45 a.m.)
> 
> 
> Review request for mesos, Andrew Schwartzmeyer and Benjamin Bannier.
> 
> 
> Bugs: MESOS-4176
>     https://issues.apache.org/jira/browse/MESOS-4176
> 
> 
> Repository: mesos
> 
> 
> Description
> -------
> 
> Fix 3rdparty build commands for FreeBSD.
> 
> 
> Diffs
> -----
> 
>   3rdparty/CMakeLists.txt 2b63b58f7d6a88c9986b746283dcfa79b7bcb270 
> 
> 
> Diff: https://reviews.apache.org/r/66314/diff/3/
> 
> 
> Testing
> -------
> 
> make on FreeBSD
> 
> 
> Thanks,
> 
> David Forsythe
> 
>


Mime
  • Unnamed multipart/alternative (inline, None, 0 bytes)
View raw message