mesos-reviews mailing list archives

Site index · List index
Message view « Date » · « Thread »
Top « Date » · « Thread »
From Mesos Reviewbot Windows <revi...@mesos.apache.org>
Subject Re: Review Request 66445: Windows: Cleaned up included CRT headers.
Date Wed, 04 Apr 2018 07:31:42 GMT

-----------------------------------------------------------
This is an automatically generated e-mail. To reply, visit:
https://reviews.apache.org/r/66445/#review200437
-----------------------------------------------------------



FAIL: Some of the unit tests failed. Please check the relevant logs.

Reviews applied: `['66420', '66421', '66422', '66423', '66424', '66425', '66426', '66427',
'66428', '66429', '66430', '66431', '66432', '66433', '66434', '66435', '66436', '66437',
'66438', '66439', '66440', '66441', '66442', '66443', '66444', '66445']`

Failed command: `Start-MesosCITesting`

All the build artifacts available at: http://dcos-win.westus.cloudapp.azure.com/mesos-build/review/66445

Relevant logs:

- [mesos-tests-stdout.log](http://dcos-win.westus.cloudapp.azure.com/mesos-build/review/66445/logs/mesos-tests-stdout.log):

```
[       OK ] Endpoint/SlaveEndpointTest.NoAuthorizer/2 (111 ms)
[----------] 9 tests from Endpoint/SlaveEndpointTest (1052 ms total)

[----------] 2 tests from ContainerizerType/DefaultContainerDNSFlagTest
[ RUN      ] ContainerizerType/DefaultContainerDNSFlagTest.ValidateFlag/0
[       OK ] ContainerizerType/DefaultContainerDNSFlagTest.ValidateFlag/0 (35 ms)
[ RUN      ] ContainerizerType/DefaultContainerDNSFlagTest.ValidateFlag/1
[       OK ] ContainerizerType/DefaultContainerDNSFlagTest.ValidateFlag/1 (38 ms)
[----------] 2 tests from ContainerizerType/DefaultContainerDNSFlagTest (75 ms total)

[----------] 1 test from IsolationFlag/CpuIsolatorTest
[ RUN      ] IsolationFlag/CpuIsolatorTest.ROOT_UserCpuUsage/0
[       OK ] IsolationFlag/CpuIsolatorTest.ROOT_UserCpuUsage/0 (856 ms)
[----------] 1 test from IsolationFlag/CpuIsolatorTest (883 ms total)

[----------] 1 test from IsolationFlag/MemoryIsolatorTest
[ RUN      ] IsolationFlag/MemoryIsolatorTest.ROOT_MemUsage/0
[       OK ] IsolationFlag/MemoryIsolatorTest.ROOT_MemUsage/0 (832 ms)
[----------] 1 test from IsolationFlag/MemoryIsolatorTest (859 ms total)

[----------] Global test environment tear-down
[==========] 949 tests from 94 test cases ran. (451622 ms total)
[  PASSED  ] 948 tests.
[  FAILED  ] 1 test, listed below:
[  FAILED  ] CommandExecutorCheckTest.CommandCheckTimeout

 1 FAILED TEST
  YOU HAVE 214 DISABLED TESTS

```

- [mesos-tests-stderr.log](http://dcos-win.westus.cloudapp.azure.com/mesos-build/review/66445/logs/mesos-tests-stderr.log):

```
I0404 07:31:24.303032 11416 executor.cpp:177] Received SUBSCRIBED event
I0404 07:31:24.308010 11416 executor.cpp:181] Subscribed executor on winbldsrv-01.zq4gs31qjdiunm1ryi1452nvnh.dx.internal.cloudapp.net
I0404 07:31:24.309013 11416 executor.cpp:177] Received LAUNCH event
I0404 07:31:24.314009 11416 executor.cpp:649] Starting task a992b0d2-fb29-4e8d-9e58-fcc4d29c11bd
I0404 07:31:24.406028 11416 executor.cpp:484] Running 'D:\DCOS\mesos\src\mesos-containerizer.exe
launch <POSSIBLY-SENSITIVE-DATA>'
I0404 07:31:24.435024 11416 executor.cpp:662] Forked command at 13220
I0404 07:31:24.467031 13304 exec.cpp:445] Executor asked to shutdown
I0404 07:31:24.468184 11768 executor.cpp:177] Received SHUTDOWN event
I0404 07:31:24.468184 11768 executor.cpp:759] Shutting down
I0404 07:31:24.468184 11768 executor.cpp:869] Sending SIGTERM to process tree at pid eduler-212854d1-0a94-48c8-a50c-e2b6cfd3f315@10.3.1.8:54729
I0404 07:31:24.466032  4212 hierarchical.cpp:405] Deactivated framework 4e219fa7-8ae4-49c7-92ba-c64f0cc8d950-0000
I0404 07:31:24.466032  1812 master.cpp:10449] Updating the state of task a992b0d2-fb29-4e8d-9e58-fcc4d29c11bd
of framework 4e219fa7-8ae4-49c7-92ba-c64f0cc8d950-0000 (latest state: TASK_KILLED, status
update state: TASK_KILLED)
I0404 07:31:24.466032 12948 slave.cpp:3877] Shutting down framework 4e219fa7-8ae4-49c7-92ba-c64f0cc8d950-0000
I0404 07:31:24.466032 12948 slave.cpp:6574] Shutting down executor 'a992b0d2-fb29-4e8d-9e58-fcc4d29c11bd'
of framework 4e219fa7-8ae4-49c7-92ba-c64f0cc8d950-0000 at executor(1)@10.3.1.8:54750
I0404 07:31:24.467031 12948 slave.cpp:923] Agent terminating
W0404 07:31:24.467031 12948 slave.cpp:3873] Ignoring shutdown framework 4e219fa7-8ae4-49c7-92ba-c64f0cc8d950-0000
because it is terminating
I0404 07:31:24.469012  1812 master.cpp:10548] Removing task a992b0d2-fb29-4e8d-9e58-fcc4d29c11bd
with resources cpus(allocated: *):4; mem(allocated: *):2048; disk(allocated: *):1024; ports(allocated:
*):[31000-32000] of framework 4e219fa7-8ae4-49c7-92ba-c64f0cc8d950-0000 on agent 4e219fa7-8ae4-49c7-92ba-c64f0cc8d950-S0
at slave(418)@10.3.1.8:54729 (winbldsrv-01.zq4gs31qjdiunm1ryi1452nvnh.dx.internal.cloudapp.net)
I0404 07:31:24.470022 12948 containerizer.cpp:2338] Destroying container 74a1724d-206e-4542-8e18-5da7867d39ea
in RUNNING state
I0404 07:31:24.471017 12948 containerizer.cpp:2952] Transitioning the state of container 74a1724d-206e-4542-8e18-5da7867d39ea
from RUNNING to DESTROYING
I0404 07:31:24.472017 12948 launcher.cpp:156] Asked to destroy container 74a1724d-206e-4542-8e18-5da7867d39ea
I0404 07:31:24.472017  1812 master.cpp:1295] Agent 4e219fa7-8ae4-49c7-92ba-c64f0cc8d950-S0
at slave(418)@10.3.1.8:54729 (winbldsrv-01.zq4gs31qjdiunm1ryi1452nvnh.dx.internal.cloudapp.net)
disconnected
I0404 07:31:24.472017  1812 master.cpp:3286] Disconnecting agent 4e219fa7-8ae4-49c7-92ba-c64f0cc8d950-S0
at slave(418)@10.3.1.8:54729 (winbldsrv-01.zq4gs31qjdiunm1ryi1452nvnh.dx.internal.cloudapp.net)
I0404 07:31:24.473018  1812 master.cpp:3305] Deactivating agent 4e219fa7-8ae4-49c7-92ba-c64f0cc8d950-S0
at slave(418)@10.3.1.8:54729 (winbldsrv-01.zq4gs31qjdiunm1ryi1452nvnh.dx.internal.cloudapp.net)
I0404 07:31:24.473018  2304 hierarchical.cpp:344] Removed framework 4e219fa7-8ae4-49c7-92ba-c64f0cc8d950-0000
I0404 07:31:24.473018  2304 hierarchical.cpp:766] Agent 4e219fa7-8ae4-49c7-92ba-c64f0cc8d950-S0
deactivated
I0404 07:31:24.529068 12196 containerizer.cpp:2791] Container 74a1724d-206e-4542-8e18-5da7867d39ea
has exited
I0404 07:31:24.563274 11508 master.cpp:1137] Master terminating
I0404 07:31:24.566069 12856 hierarchical.cpp:609] Removed agent 4e219fa7-8ae4-49c7-92ba-c64f0cc8d950-S0
I0404 07:31:25.051106 14260 process.cpp:929] Stopped the socket accept loop
```

- Mesos Reviewbot Windows


On April 4, 2018, 5:58 a.m., Andrew Schwartzmeyer wrote:
> 
> -----------------------------------------------------------
> This is an automatically generated e-mail. To reply, visit:
> https://reviews.apache.org/r/66445/
> -----------------------------------------------------------
> 
> (Updated April 4, 2018, 5:58 a.m.)
> 
> 
> Review request for mesos, Akash Gupta, Eric Mumau, John Kordich, Joseph Wu, and Michael
Park.
> 
> 
> Bugs: MESOS-8682
>     https://issues.apache.org/jira/browse/MESOS-8682
> 
> 
> Repository: mesos
> 
> 
> Description
> -------
> 
> The set `errno` value in `os::kill()` is never checked (especially on
> Windows), so `_set_errno()` and thus `errno.h` were removed.
> 
> The `fcntl.h` is used only to provide `O_CREAT` etc., and so belonged
> in `open.hpp`, not `windows.hpp`.
> 
> The remaining headers, `direct.h`, `io.h`, `process.h`, and `stdlib.h`
> were no longer used or needed as the respective CRT APIs were
> replaced.
> 
> 
> Diffs
> -----
> 
>   3rdparty/stout/include/stout/os/windows/kill.hpp 9cec1117fac3cf6bd624fc7db524ef1ad10cd55d

>   3rdparty/stout/include/stout/os/windows/mkdtemp.hpp 9181429383a991fe2b87701d2bfd0e858ac2537b

>   3rdparty/stout/include/stout/os/windows/open.hpp PRE-CREATION 
>   3rdparty/stout/include/stout/os/windows/rmdir.hpp a2926dab2c8e219cf5938c4df27f83488198dd6b

>   3rdparty/stout/include/stout/os/windows/sendfile.hpp fff5872db6b3f69464e41e6d108a107e4eeabd12

>   3rdparty/stout/include/stout/windows.hpp 1bfcdf4a5c097cc6d2293396ce39c8ad2c9ec993 
>   3rdparty/stout/include/stout/windows/dynamiclibrary.hpp 5b3cbf4f36ea9ac0411df52b4cfea8ef75fecbb5

>   3rdparty/stout/include/stout/windows/os.hpp 739ee4da3f09d2a9597d4451e755e77903e9287d

> 
> 
> Diff: https://reviews.apache.org/r/66445/diff/1/
> 
> 
> Testing
> -------
> 
> 
> Thanks,
> 
> Andrew Schwartzmeyer
> 
>


Mime
  • Unnamed multipart/alternative (inline, None, 0 bytes)
View raw message