mesos-reviews mailing list archives

Site index · List index
Message view « Date » · « Thread »
Top « Date » · « Thread »
From Mesos Reviewbot Windows <revi...@mesos.apache.org>
Subject Re: Review Request 66392: Find sasl2 on non-Windows platforms before trying to link it.
Date Wed, 04 Apr 2018 05:42:59 GMT

-----------------------------------------------------------
This is an automatically generated e-mail. To reply, visit:
https://reviews.apache.org/r/66392/#review200424
-----------------------------------------------------------



FAIL: Some of the unit tests failed. Please check the relevant logs.

Reviews applied: `['66384', '66385', '66387', '66392']`

Failed command: `Start-MesosCITesting`

All the build artifacts available at: http://dcos-win.westus.cloudapp.azure.com/mesos-build/review/66392

Relevant logs:

- [mesos-tests-stdout.log](http://dcos-win.westus.cloudapp.azure.com/mesos-build/review/66392/logs/mesos-tests-stdout.log):

```
[       OK ] Endpoint/SlaveEndpointTest.NoAuthorizer/2 (110 ms)
[----------] 9 tests from Endpoint/SlaveEndpointTest (1043 ms total)

[----------] 2 tests from ContainerizerType/DefaultContainerDNSFlagTest
[ RUN      ] ContainerizerType/DefaultContainerDNSFlagTest.ValidateFlag/0
[       OK ] ContainerizerType/DefaultContainerDNSFlagTest.ValidateFlag/0 (35 ms)
[ RUN      ] ContainerizerType/DefaultContainerDNSFlagTest.ValidateFlag/1
[       OK ] ContainerizerType/DefaultContainerDNSFlagTest.ValidateFlag/1 (37 ms)
[----------] 2 tests from ContainerizerType/DefaultContainerDNSFlagTest (75 ms total)

[----------] 1 test from IsolationFlag/CpuIsolatorTest
[ RUN      ] IsolationFlag/CpuIsolatorTest.ROOT_UserCpuUsage/0
[       OK ] IsolationFlag/CpuIsolatorTest.ROOT_UserCpuUsage/0 (842 ms)
[----------] 1 test from IsolationFlag/CpuIsolatorTest (868 ms total)

[----------] 1 test from IsolationFlag/MemoryIsolatorTest
[ RUN      ] IsolationFlag/MemoryIsolatorTest.ROOT_MemUsage/0
[       OK ] IsolationFlag/MemoryIsolatorTest.ROOT_MemUsage/0 (838 ms)
[----------] 1 test from IsolationFlag/MemoryIsolatorTest (865 ms total)

[----------] Global test environment tear-down
[==========] 949 tests from 94 test cases ran. (450124 ms total)
[  PASSED  ] 948 tests.
[  FAILED  ] 1 test, listed below:
[  FAILED  ] CommandExecutorCheckTest.CommandCheckTimeout

 1 FAILED TEST
  YOU HAVE 214 DISABLED TESTS

```

- [mesos-tests-stderr.log](http://dcos-win.westus.cloudapp.azure.com/mesos-build/review/66392/logs/mesos-tests-stderr.log):

```
I0404 05:42:43.383244 10852 master.cpp:10449] Updating the state of task 10bb697e-9f99-4452-8a1c-fd342943ca7b
of framework 94d81d79-ea86-457c-a5c1-aa1f22d10581-0000 (latest state: TASK_KILLED, status
update state: TASKI0404 05:42:43.207343 13508 exec.cpp:162] Version: 1.6.0
I0404 05:42:43.232236 10728 exec.cpp:236] Executor registered on agent 94d81d79-ea86-457c-a5c1-aa1f22d10581-S0
I0404 05:42:43.236229  2300 executor.cpp:176] Received SUBSCRIBED event
I0404 05:42:43.240231  2300 executor.cpp:180] Subscribed executor on winbldsrv-01.zq4gs31qjdiunm1ryi1452nvnh.dx.internal.cloudapp.net
I0404 05:42:43.240231  2300 executor.cpp:176] Received LAUNCH event
I0404 05:42:43.246279  2300 executor.cpp:648] Starting task 10bb697e-9f99-4452-8a1c-fd342943ca7b
I0404 05:42:43.325275  2300 executor.cpp:483] Running 'D:\DCOS\mesos\src\mesos-containerizer.exe
launch <POSSIBLY-SENSITIVE-DATA>'
I0404 05:42:43.352234  2300 executor.cpp:661] Forked command at 12580
I0404 05:42:43.385232 11656 exec.cpp:445] Executor asked to shutdown
I0404 05:42:43.386242 12400 executor.cpp:176] Received SHUTDOWN event
I0404 05:42:43.386242 12400 executor.cpp:758] Shutting down
I0404 05:42:43.386242 12400 executor.cpp:868] Sending SIGTERM to process tree at pid _KILLED)
I0404 05:42:43.383244 13868 slave.cpp:3877] Shutting down framework 94d81d79-ea86-457c-a5c1-aa1f22d10581-0000
I0404 05:42:43.384235 13868 slave.cpp:6574] Shutting down executor '10bb697e-9f99-4452-8a1c-fd342943ca7b'
of framework 94d81d79-ea86-457c-a5c1-aa1f22d10581-0000 at executor(1)@10.3.1.8:49868
I0404 05:42:43.384235  8864 slave.cpp:923] Agent terminating
W0404 05:42:43.385232  8864 slave.cpp:3873] Ignoring shutdown framework 94d81d79-ea86-457c-a5c1-aa1f22d10581-0000
because it is terminating
I0404 05:42:43.386242 10852 master.cpp:10548] Removing task 10bb697e-9f99-4452-8a1c-fd342943ca7b
with resources cpus(allocated: *):4; mem(allocated: *):2048; disk(allocated: *):1024; ports(allocated:
*):[31000-32000] of framework 94d81d79-ea86-457c-a5c1-aa1f22d10581-0000 on agent 94d81d79-ea86-457c-a5c1-aa1f22d10581-S0
at slave(418)@10.3.1.8:49847 (winbldsrv-01.zq4gs31qjdiunm1ryi1452nvnh.dx.internal.cloudapp.net)
I0404 05:42:43.388272 10852 master.cpp:1295] Agent 94d81d79-ea86-457c-a5c1-aa1f22d10581-S0
at slave(418)@10.3.1.8:49847 (winbldsrv-01.zq4gs31qjdiunm1ryi1452nvnh.dx.internal.cloudapp.net)
disconnected
I0404 05:42:43.388272 14080 containerizer.cpp:2338] Destroying container 3c10e52b-ee67-45f1-9ef4-44f52d6c34d9
in RUNNING state
I0404 05:42:43.389245 10852 master.cpp:3286] Disconnecting agent 94d81d79-ea86-457c-a5c1-aa1f22d10581-S0
at slave(418)@10.3.1.8:49847 (winbldsrv-01.zq4gs31qjdiunm1ryi1452nvnh.dx.internal.cloudapp.net)
I0404 05:42:43.389245 14080 containerizer.cpp:2952] Transitioning the state of container 3c10e52b-ee67-45f1-9ef4-44f52d6c34d9
from RUNNING to DESTROYING
I0404 05:42:43.389245 10852 master.cpp:3305] Deactivating agent 94d81d79-ea86-457c-a5c1-aa1f22d10581-S0
at slave(418)@10.3.1.8:49847 (winbldsrv-01.zq4gs31qjdiunm1ryi1452nvnh.dx.internal.cloudapp.net)
I0404 05:42:43.390241 11360 hierarchical.cpp:344] Removed framework 94d81d79-ea86-457c-a5c1-aa1f22d10581-0000
I0404 05:42:43.390241 11360 hierarchical.cpp:766] Agent 94d81d79-ea86-457c-a5c1-aa1f22d10581-S0
deactivated
I0404 05:42:43.390241 14080 launcher.cpp:156] Asked to destroy container 3c10e52b-ee67-45f1-9ef4-44f52d6c34d9
I0404 05:42:43.501907  6948 containerizer.cpp:2791] Container 3c10e52b-ee67-45f1-9ef4-44f52d6c34d9
has exited
I0404 05:42:43.535905  8864 master.cpp:1137] Master terminating
I0404 05:42:43.537885 11360 hierarchical.cpp:609] Removed agent 94d81d79-ea86-457c-a5c1-aa1f22d10581-S0
I0404 05:42:44.015918  9320 process.cpp:929] Stopped the socket accept loop
```

- Mesos Reviewbot Windows


On April 3, 2018, 8:46 p.m., David Forsythe wrote:
> 
> -----------------------------------------------------------
> This is an automatically generated e-mail. To reply, visit:
> https://reviews.apache.org/r/66392/
> -----------------------------------------------------------
> 
> (Updated April 3, 2018, 8:46 p.m.)
> 
> 
> Review request for mesos and Andrew Schwartzmeyer.
> 
> 
> Bugs: MESOS-4176
>     https://issues.apache.org/jira/browse/MESOS-4176
> 
> 
> Repository: mesos
> 
> 
> Description
> -------
> 
> Find sasl2 on non-Windows platforms before trying to link it.
> 
> 
> Diffs
> -----
> 
>   3rdparty/CMakeLists.txt 2b63b58f7d6a88c9986b746283dcfa79b7bcb270 
> 
> 
> Diff: https://reviews.apache.org/r/66392/diff/3/
> 
> 
> Testing
> -------
> 
> make on FreeBSD
> 
> 
> Thanks,
> 
> David Forsythe
> 
>


Mime
  • Unnamed multipart/alternative (inline, None, 0 bytes)
View raw message