mesos-reviews mailing list archives

Site index · List index
Message view « Date » · « Thread »
Top « Date » · « Thread »
From Mesos Reviewbot Windows <revi...@mesos.apache.org>
Subject Re: Review Request 66412: Fixed flaky agent test.
Date Tue, 03 Apr 2018 23:06:38 GMT

-----------------------------------------------------------
This is an automatically generated e-mail. To reply, visit:
https://reviews.apache.org/r/66412/#review200402
-----------------------------------------------------------



FAIL: Some of the unit tests failed. Please check the relevant logs.

Reviews applied: `['66118', '66119', '66120', '65679', '66126', '66143', '66322', '66144',
'66145', '66178', '66323', '66346', '66347', '66412']`

Failed command: `Start-MesosCITesting`

All the build artifacts available at: http://dcos-win.westus.cloudapp.azure.com/mesos-build/review/66412

Relevant logs:

- [mesos-tests-stdout.log](http://dcos-win.westus.cloudapp.azure.com/mesos-build/review/66412/logs/mesos-tests-stdout.log):

```
[       OK ] Endpoint/SlaveEndpointTest.NoAuthorizer/2 (107 ms)
[----------] 9 tests from Endpoint/SlaveEndpointTest (1069 ms total)

[----------] 2 tests from ContainerizerType/DefaultContainerDNSFlagTest
[ RUN      ] ContainerizerType/DefaultContainerDNSFlagTest.ValidateFlag/0
[       OK ] ContainerizerType/DefaultContainerDNSFlagTest.ValidateFlag/0 (31 ms)
[ RUN      ] ContainerizerType/DefaultContainerDNSFlagTest.ValidateFlag/1
[       OK ] ContainerizerType/DefaultContainerDNSFlagTest.ValidateFlag/1 (36 ms)
[----------] 2 tests from ContainerizerType/DefaultContainerDNSFlagTest (70 ms total)

[----------] 1 test from IsolationFlag/CpuIsolatorTest
[ RUN      ] IsolationFlag/CpuIsolatorTest.ROOT_UserCpuUsage/0
[       OK ] IsolationFlag/CpuIsolatorTest.ROOT_UserCpuUsage/0 (835 ms)
[----------] 1 test from IsolationFlag/CpuIsolatorTest (860 ms total)

[----------] 1 test from IsolationFlag/MemoryIsolatorTest
[ RUN      ] IsolationFlag/MemoryIsolatorTest.ROOT_MemUsage/0
[       OK ] IsolationFlag/MemoryIsolatorTest.ROOT_MemUsage/0 (834 ms)
[----------] 1 test from IsolationFlag/MemoryIsolatorTest (860 ms total)

[----------] Global test environment tear-down
[==========] 954 tests from 94 test cases ran. (469753 ms total)
[  PASSED  ] 953 tests.
[  FAILED  ] 1 test, listed below:
[  FAILED  ] CommandExecutorCheckTest.CommandCheckTimeout

 1 FAILED TEST
  YOU HAVE 214 DISABLED TESTS

```

- [mesos-tests-stderr.log](http://dcos-win.westus.cloudapp.azure.com/mesos-build/review/66412/logs/mesos-tests-stderr.log):

```
I0403 23:04:33.120618  6728 master.cpp:10449] Updating the state of task 8383afcf-80b8-4b1d-8f92-357dd43a05e5
of framework 20e0e59c-20f3-4d45-8f75-d85e140a7e00-0000 (latest state: TASK_KILLED, status
update state: TASK_KILLED)
I0403 23:04:33.120618  5904 slave.cpp:3973] Shutting down framework 20e0e59c-20f3-4d45-8f75-d85e140a7e00-0000
I0403 23:04:33.120618  5904 slave.cpp:6670] Shutting down executor '8383afcf-80b8-4b1d-8f92-357dd43a05e5'
of framework 20e0e59c-20f3-4d45-8f75-d85e140a7e00-0000 at executor(1)@10.3.1.8:61262
I0403 23:04:33.121605  5700 slave.cI0403 23:04:32.941620  9416 exec.cpp:162] Version: 1.6.0
I0403 23:04:32.970605  9808 exec.cpp:236] Executor registered on agent 20e0e59c-20f3-4d45-8f75-d85e140a7e00-S0
I0403 23:04:32.974613  7368 executor.cpp:176] Received SUBSCRIBED event
I0403 23:04:32.978612  7368 executor.cpp:180] Subscribed executor on winbldsrv-01.zq4gs31qjdiunm1ryi1452nvnh.dx.internal.cloudapp.net
I0403 23:04:32.978612  7368 executor.cpp:176] Received LAUNCH event
I0403 23:04:32.983613  7368 executor.cpp:648] Starting task 8383afcf-80b8-4b1d-8f92-357dd43a05e5
I0403 23:04:33.061606  7368 executor.cpp:483] Running 'D:\DCOS\mesos\src\mesos-containerizer.exe
launch <POSSIBLY-SENSITIVE-DATA>'
I0403 23:04:33.087615  7368 executor.cpp:661] Forked command at 10384
I0403 23:04:33.122601  6160 exec.cpp:445] Executor asked to shutdown
I0403 23:04:33.122601  7020 executor.cpp:176] Received SHUTDOWN event
I0403 23:04:33.122601  7020 executor.cpp:758] Shutting down
I0403 23:04:33.122601  7020 executor.cpp:868] Sending SIGTERM to process tree at pid pp:923]
Agent terminating
W0403 23:04:33.122601  5700 slave.cpp:3969] Ignoring shutdown framework 20e0e59c-20f3-4d45-8f75-d85e140a7e00-0000
because it is terminating
I0403 23:04:33.122601  6728 master.cpp:10548] Removing task 8383afcf-80b8-4b1d-8f92-357dd43a05e5
with resources cpus(allocated: *):4; mem(allocated: *):2048; disk(allocated: *):1024; ports(allocated:
*):[31000-32000] of framework 20e0e59c-20f3-4d45-8f75-d85e140a7e00-0000 on agent 20e0e59c-20f3-4d45-8f75-d85e140a7e00-S0
at slave(423)@10.3.1.8:61241 (winbldsrv-01.zq4gs31qjdiunm1ryi1452nvnh.dx.internal.cloudapp.net)
I0403 23:04:33.125607  6728 master.cpp:1295] Agent 20e0e59c-20f3-4d45-8f75-d85e140a7e00-S0
at slave(423)@10.3.1.8:61241 (winbldsrv-01.zq4gs31qjdiunm1ryi1452nvnh.dx.internal.cloudapp.net)
disconnected
I0403 23:04:33.125607  6728 master.cpp:3286] Disconnecting agent 20e0e59c-20f3-4d45-8f75-d85e140a7e00-S0
at slave(423)@10.3.1.8:61241 (winbldsrv-01.zq4gs31qjdiunm1ryi1452nvnh.dx.internal.cloudapp.net)
I0403 23:04:33.125607  6728 master.cpp:3305] Deactivating agent 20e0e59c-20f3-4d45-8f75-d85e140a7e00-S0
at slave(423)@10.3.1.8:61241 (winbldsrv-01.zq4gs31qjdiunm1ryi1452nvnh.dx.internal.cloudapp.net)
I0403 23:04:33.126626  3512 hierarchical.cpp:344] Removed framework 20e0e59c-20f3-4d45-8f75-d85e140a7e00-0000
I0403 23:04:33.126626 13140 containerizer.cpp:2338] Destroying container 91ecf3c9-ee61-432c-b06a-220a94a82059
in RUNNING state
I0403 23:04:33.126626 13140 containerizer.cpp:2952] Transitioning the state of container 91ecf3c9-ee61-432c-b06a-220a94a82059
from RUNNING to DESTROYING
I0403 23:04:33.126626  3512 hierarchical.cpp:766] Agent 20e0e59c-20f3-4d45-8f75-d85e140a7e00-S0
deactivated
I0403 23:04:33.127617 13140 launcher.cpp:156] Asked to destroy container 91ecf3c9-ee61-432c-b06a-220a94a82059
I0403 23:04:33.238870 12256 containerizer.cpp:2791] Container 91ecf3c9-ee61-432c-b06a-220a94a82059
has exited
I0403 23:04:33.271828 13200 master.cpp:1137] Master terminating
I0403 23:04:33.273828  3512 hierarchical.cpp:609] Removed agent 20e0e59c-20f3-4d45-8f75-d85e140a7e00-S0
I0403 23:04:33.683845 11248 process.cpp:929] Stopped the socket accept loop
```

- Mesos Reviewbot Windows


On April 3, 2018, 3:10 p.m., Meng Zhu wrote:
> 
> -----------------------------------------------------------
> This is an automatically generated e-mail. To reply, visit:
> https://reviews.apache.org/r/66412/
> -----------------------------------------------------------
> 
> (Updated April 3, 2018, 3:10 p.m.)
> 
> 
> Review request for mesos and Greg Mann.
> 
> 
> Repository: mesos
> 
> 
> Description
> -------
> 
> In test `KillTaskGroupBetweenRunTaskParts`, added extra
> synchronization to ensure `unmocked__run` finishes before
> the test tear down.
> 
> Also updated all dispatch calls to capture by value to avoid
> potential races where the arguments might be destroyed
> while the dispatch call is still running.
> 
> 
> Diffs
> -----
> 
>   src/tests/slave_tests.cpp 0d7d9726ee39e4c588ea5eb8a54a73fbe1249353 
> 
> 
> Diff: https://reviews.apache.org/r/66412/diff/1/
> 
> 
> Testing
> -------
> 
> make check
> 
> 
> Thanks,
> 
> Meng Zhu
> 
>


Mime
  • Unnamed multipart/alternative (inline, None, 0 bytes)
View raw message