mesos-reviews mailing list archives

Site index · List index
Message view « Date » · « Thread »
Top « Date » · « Thread »
From Mesos Reviewbot Windows <revi...@mesos.apache.org>
Subject Re: Review Request 66396: Bugfix for MESOS-8308.
Date Tue, 03 Apr 2018 15:38:29 GMT

-----------------------------------------------------------
This is an automatically generated e-mail. To reply, visit:
https://reviews.apache.org/r/66396/#review200368
-----------------------------------------------------------



FAIL: Some of the unit tests failed. Please check the relevant logs.

Reviews applied: `['66396']`

Failed command: `Start-MesosCITesting`

All the build artifacts available at: http://dcos-win.westus.cloudapp.azure.com/mesos-build/review/66396

Relevant logs:

- [stout-tests-stdout.log](http://dcos-win.westus.cloudapp.azure.com/mesos-build/review/66396/logs/stout-tests-stdout.log):

```
[ RUN      ] RmdirTest.SYMLINK_RemoveDirectoryWithSymbolicLinkTargetDirectory
[       OK ] RmdirTest.SYMLINK_RemoveDirectoryWithSymbolicLinkTargetDirectory (5 ms)
[ RUN      ] RmdirTest.SYMLINK_RemoveDirectoryWithSymbolicLinkTargetFile
[       OK ] RmdirTest.SYMLINK_RemoveDirectoryWithSymbolicLinkTargetFile (4 ms)
[ RUN      ] RmdirTest.RemoveDirectoryButPreserveRoot
[       OK ] RmdirTest.RemoveDirectoryButPreserveRoot (6 ms)
[----------] 11 tests from RmdirTest (52 ms total)

[----------] 1 test from SocketTests
[ RUN      ] SocketTests.InitSocket
[       OK ] SocketTests.InitSocket (1 ms)
[----------] 1 test from SocketTests (2 ms total)

[----------] 2 tests from StrerrorTest
[ RUN      ] StrerrorTest.ValidErrno
[       OK ] StrerrorTest.ValidErrno (0 ms)
[ RUN      ] StrerrorTest.InvalidErrno
[       OK ] StrerrorTest.InvalidErrno (0 ms)
[----------] 2 tests from StrerrorTest (1 ms total)

[----------] Global test environment tear-down
[==========] 275 tests from 46 test cases ran. (3993 ms total)
[  PASSED  ] 274 tests.
[  FAILED  ] 1 test, listed below:
[  FAILED  ] OsTest.System

 1 FAILED TEST
  YOU HAVE 7 DISABLED TESTS

```

- [stout-tests-stderr.log](http://dcos-win.westus.cloudapp.azure.com/mesos-build/review/66396/logs/stout-tests-stderr.log):

```
ERROR: Input redirection is not supported, exiting the process immediately.
'invalid.command' is not recognized as an internal or external command,
operable program or batch file.
Subcommand 'subcommand' is not available
Usage: command <subcommand> [OPTIONS]

Available subcommands:
    help
    subcommand2

Multiple subcommands have name 'subcommand'
```

- [mesos-tests-stdout.log](http://dcos-win.westus.cloudapp.azure.com/mesos-build/review/66396/logs/mesos-tests-stdout.log):

```
[ RUN      ] IsolationFlag/MemoryIsolatorTest.ROOT_MemUsage/0
[       OK ] IsolationFlag/MemoryIsolatorTest.ROOT_MemUsage/0 (841 ms)
[----------] 1 test from IsolationFlag/MemoryIsolatorTest (862 ms total)

[----------] Global test environment tear-down
[==========] 949 tests from 94 test cases ran. (501995 ms total)
[  PASSED  ] 932 tests.
[  FAILED  ] 17 tests, listed below:
[  FAILED  ] CommandExecutorCheckTest.CommandCheckStatusChange
[  FAILED  ] CommandExecutorCheckTest.CommandCheckTimeout
[  FAILED  ] CommandExecutorCheckTest.CommandCheckAndHealthCheckNoShadowing
[  FAILED  ] DefaultExecutorCheckTest.CommandCheckAndHealthCheckNoShadowing
[  FAILED  ] HealthCheckTest.HealthStatusChange
[  FAILED  ] HealthCheckTest.ConsecutiveFailures
[  FAILED  ] HealthCheckTest.GracePeriod
[  FAILED  ] HealthCheckTest.HealthyToUnhealthyTransitionWithinGracePeriod
[  FAILED  ] PartitionTest.AgentWithTerminalTaskPartitioned
[  FAILED  ] SlaveRecoveryTest/0.ReconcileKillTask, where TypeParam = class mesos::internal::slave::MesosContainerizer
[  FAILED  ] SlaveRecoveryTest/0.MultipleFrameworks, where TypeParam = class mesos::internal::slave::MesosContainerizer
[  FAILED  ] SlaveRecoveryTest/0.MultipleSlaves, where TypeParam = class mesos::internal::slave::MesosContainerizer
[  FAILED  ] SlaveRecoveryTest/0.AgentReconfigurationWithRunningTask, where TypeParam = class
mesos::internal::slave::MesosContainerizer
[  FAILED  ] MesosContainerizer/DefaultExecutorTest.KillTask/0, where GetParam() = "mesos"
[  FAILED  ] MesosContainerizer/DefaultExecutorTest.CommitSuicideOnKillTask/0, where GetParam()
= "mesos"
[  FAILED  ] ROOT_DOCKER_DockerAndMesosContainerizers/DefaultExecutorTest.KillTask/0, where
GetParam() = "docker,mesos"
[  FAILED  ] ROOT_DOCKER_DockerAndMesosContainerizers/DefaultExecutorTest.CommitSuicideOnKillTask/0,
where GetParam() = "docker,mesos"

17 FAILED TESTS
  YOU HAVE 214 DISABLED TESTS

```

- [mesos-tests-stderr.log](http://dcos-win.westus.cloudapp.azure.com/mesos-build/review/66396/logs/mesos-tests-stderr.log):

```
I0403 15:38:15.936280  7328 master.cpp:10449] Updating the state of task 487fcdd6-ec0e-4dc8-9370-31dd048db53a
of framework 030d21ba-086c-455c-89cf-5783535329b6-0000 (latest state: TASK_KILLED, status
update state: TASK_KILLED)
I0403 15:38:15.936280 10708 slave.cpp:3877] Shutting down framework 030d21ba-086c-455c-89cf-5783535329b6-0000
I0403 15:38:15.937281 10708 slave.cpp:6574] Shutting down executor '487fcdd6-ec0e-4dc8-9370-31dd048db53a'
of framework 030d21ba-086c-455c-89cf-5783535329b6-0000 at executor(1)@10.3.1.5:52116
I0403 15:38:15.937281 10708 slave.cpp:923] Agent terminating
W0403 15:38:15.937281 10708 slave.cpp:3873] Ignoring shutdown framework 030d21ba-086c-455c-89cf-5783535329b6-0000
because it is terminating
I0403 15:38:15.940305  7328 master.cpp:10548] Removing task 487fcdd6-ec0e-4dc8-9370-31dd048db53a
with resources cpus(allocated: *):4; mem(allocated: *):2048; disk(allocated: *):1024; ports(allocated:
*):[31000-32000] of framework 030d21ba-086c-455c-89cf-5783535329b6-0000 on agent 030d2I0403
15:38:15.748276  5320 exec.cpp:162] Version: 1.6.0
I0403 15:38:15.773283  5944 exec.cpp:236] Executor registered on agent 030d21ba-086c-455c-89cf-5783535329b6-S0
I0403 15:38:15.776280  7428 executor.cpp:176] Received SUBSCRIBED event
I0403 15:38:15.782277  7428 executor.cpp:180] Subscribed executor on winbldsrv-02.zq4gs31qjdiunm1ryi1452nvnh.dx.internal.cloudapp.net
I0403 15:38:15.782277  7428 executor.cpp:176] Received LAUNCH event
I0403 15:38:15.788277  7428 executor.cpp:648] Starting task 487fcdd6-ec0e-4dc8-9370-31dd048db53a
I0403 15:38:15.879281  7428 executor.cpp:483] Running 'D:\DCOS\mesos\src\mesos-containerizer.exe
launch <POSSIBLY-SENSITIVE-DATA>'
I0403 15:38:15.910276  7428 executor.cpp:661] Forked command at 6176
I0403 15:38:15.939710  5224 exec.cpp:445] Executor asked to shutdown
I0403 15:38:15.940305  1472 executor.cpp:176] Received SHUTDOWN event
I0403 15:38:15.940305  1472 executor.cpp:758] Shutting down
I0403 15:38:15.940305  1472 executor.cpp:868] Sending SIGTERM to process tree at pid 61ba-086c-455c-89cf-5783535329b6-S0
at slave(418)@10.3.1.5:52095 (winbldsrv-02.zq4gs31qjdiunm1ryi1452nvnh.dx.internal.cloudapp.net)
I0403 15:38:15.942268  3296 containerizer.cpp:2338] Destroying container 74e0a764-0479-456b-93e7-cb309f97592f
in RUNNING state
I0403 15:38:15.942268  3296 containerizer.cpp:2952] Transitioning the state of container 74e0a764-0479-456b-93e7-cb309f97592f
from RUNNING to DESTROYING
I0403 15:38:15.943267  7328 master.cpp:1295] Agent 030d21ba-086c-455c-89cf-5783535329b6-S0
at slave(418)@10.3.1.5:52095 (winbldsrv-02.zq4gs31qjdiunm1ryi1452nvnh.dx.internal.cloudapp.net)
disconnected
I0403 15:38:15.943267  7328 master.cpp:3286] Disconnecting agent 030d21ba-086c-455c-89cf-5783535329b6-S0
at slave(418)@10.3.1.5:52095 (winbldsrv-02.zq4gs31qjdiunm1ryi1452nvnh.dx.internal.cloudapp.net)
I0403 15:38:15.943267  7328 master.cpp:3305] Deactivating agent 030d21ba-086c-455c-89cf-5783535329b6-S0
at slave(418)@10.3.1.5:52095 (winbldsrv-02.zq4gs31qjdiunm1ryi1452nvnh.dx.internal.cloudapp.net)
I0403 15:38:15.944268  3296 launcher.cpp:156] Asked to destroy container 74e0a764-0479-456b-93e7-cb309f97592f
I0403 15:38:15.944268  4528 hierarchical.cpp:344] Removed framework 030d21ba-086c-455c-89cf-5783535329b6-0000
I0403 15:38:15.944268  4528 hierarchical.cpp:766] Agent 030d21ba-086c-455c-89cf-5783535329b6-S0
deactivated
I0403 15:38:16.033334  3600 containerizer.cpp:2791] Container 74e0a764-0479-456b-93e7-cb309f97592f
has exited
I0403 15:38:16.065287  6904 master.cpp:1137] Master terminating
I0403 15:38:16.067281  2744 hierarchical.cpp:609] Removed agent 030d21ba-086c-455c-89cf-5783535329b6-S0
I0403 15:38:16.520645  8600 process.cpp:929] Stopped the socket accept loop
```

- Mesos Reviewbot Windows


On April 2, 2018, 11:11 p.m., Eric Mumau wrote:
> 
> -----------------------------------------------------------
> This is an automatically generated e-mail. To reply, visit:
> https://reviews.apache.org/r/66396/
> -----------------------------------------------------------
> 
> (Updated April 2, 2018, 11:11 p.m.)
> 
> 
> Review request for Andrew Schwartzmeyer.
> 
> 
> Repository: mesos
> 
> 
> Description
> -------
> 
> Changed SLEEP_COMMAND on Windows platforms from using powershell Start-Sleep to using
DOS timeout.
> 
> 
> Diffs
> -----
> 
>   3rdparty/stout/include/stout/gtest.hpp ae0c3d51b26951899f575beef3821fc48ef16ecf 
> 
> 
> Diff: https://reviews.apache.org/r/66396/diff/1/
> 
> 
> Testing
> -------
> 
> Ran mesos-test.exe on 2 different Windows machines.
> 
> 
> Thanks,
> 
> Eric Mumau
> 
>


Mime
  • Unnamed multipart/alternative (inline, None, 0 bytes)
View raw message