mesos-reviews mailing list archives

Site index · List index
Message view « Date » · « Thread »
Top « Date » · « Thread »
From Mesos Reviewbot Windows <revi...@mesos.apache.org>
Subject Re: Review Request 66392: Find sasl2 on non-Windows platforms before trying to link it.
Date Tue, 03 Apr 2018 15:13:50 GMT

-----------------------------------------------------------
This is an automatically generated e-mail. To reply, visit:
https://reviews.apache.org/r/66392/#review200363
-----------------------------------------------------------



FAIL: Some of the unit tests failed. Please check the relevant logs.

Reviews applied: `['66384', '66385', '66387', '66392']`

Failed command: `Start-MesosCITesting`

All the build artifacts available at: http://dcos-win.westus.cloudapp.azure.com/mesos-build/review/66392

Relevant logs:

- [mesos-tests-stdout.log](http://dcos-win.westus.cloudapp.azure.com/mesos-build/review/66392/logs/mesos-tests-stdout.log):

```
[       OK ] Endpoint/SlaveEndpointTest.NoAuthorizer/2 (110 ms)
[----------] 9 tests from Endpoint/SlaveEndpointTest (1045 ms total)

[----------] 2 tests from ContainerizerType/DefaultContainerDNSFlagTest
[ RUN      ] ContainerizerType/DefaultContainerDNSFlagTest.ValidateFlag/0
[       OK ] ContainerizerType/DefaultContainerDNSFlagTest.ValidateFlag/0 (35 ms)
[ RUN      ] ContainerizerType/DefaultContainerDNSFlagTest.ValidateFlag/1
[       OK ] ContainerizerType/DefaultContainerDNSFlagTest.ValidateFlag/1 (37 ms)
[----------] 2 tests from ContainerizerType/DefaultContainerDNSFlagTest (76 ms total)

[----------] 1 test from IsolationFlag/CpuIsolatorTest
[ RUN      ] IsolationFlag/CpuIsolatorTest.ROOT_UserCpuUsage/0
[       OK ] IsolationFlag/CpuIsolatorTest.ROOT_UserCpuUsage/0 (753 ms)
[----------] 1 test from IsolationFlag/CpuIsolatorTest (778 ms total)

[----------] 1 test from IsolationFlag/MemoryIsolatorTest
[ RUN      ] IsolationFlag/MemoryIsolatorTest.ROOT_MemUsage/0
[       OK ] IsolationFlag/MemoryIsolatorTest.ROOT_MemUsage/0 (837 ms)
[----------] 1 test from IsolationFlag/MemoryIsolatorTest (869 ms total)

[----------] Global test environment tear-down
[==========] 949 tests from 94 test cases ran. (453407 ms total)
[  PASSED  ] 948 tests.
[  FAILED  ] 1 test, listed below:
[  FAILED  ] CommandExecutorCheckTest.CommandCheckTimeout

 1 FAILED TEST
  YOU HAVE 214 DISABLED TESTS

```

- [mesos-tests-stderr.log](http://dcos-win.westus.cloudapp.azure.com/mesos-build/review/66392/logs/mesos-tests-stderr.log):

```
I0403 15:13:36.149655 12064 master.cpp:10449] Updating the state of task ce033352-3304-4c10-91be-ec51323bc780
of framework c90b45e2-87e6-4830-9850-929c00660c52-0000 (latest state: TASK_KILLED, status
update state: TASK_KILLED)
I0403 15:13:36.149655 11792 slave.cpp:3877] Shutting down framework c90b45e2-87e6-4830-9850-929c00660c52-0I0403
15:13:35.974665 10404 exec.cpp:162] Version: 1.6.0
I0403 15:13:36.001674  2792 exec.cpp:236] Executor registered on agent c90b45e2-87e6-4830-9850-929c00660c52-S0
I0403 15:13:36.005637 10704 executor.cpp:176] Received SUBSCRIBED event
I0403 15:13:36.009672 10704 executor.cpp:180] Subscribed executor on winbldsrv-01.zq4gs31qjdiunm1ryi1452nvnh.dx.internal.cloudapp.net
I0403 15:13:36.010671 10704 executor.cpp:176] Received LAUNCH event
I0403 15:13:36.014672 10704 executor.cpp:648] Starting task ce033352-3304-4c10-91be-ec51323bc780
I0403 15:13:36.092672 10704 executor.cpp:483] Running 'D:\DCOS\mesos\src\mesos-containerizer.exe
launch <POSSIBLY-SENSITIVE-DATA>'
I0403 15:13:36.122673 10704 executor.cpp:661] Forked command at 13268
I0403 15:13:36.152819 12036 exec.cpp:445] Executor asked to shutdown
I0403 15:13:36.152819 10912 executor.cpp:176] Received SHUTDOWN event
I0403 15:13:36.153641 10912 executor.cpp:758] Shutting down
I0403 15:13:36.153641 10912 executor.cpp:868] Sending SIGTERM to process tree at pid 000
I0403 15:13:36.150672 11792 slave.cpp:6574] Shutting down executor 'ce033352-3304-4c10-91be-ec51323bc780'
of framework c90b45e2-87e6-4830-9850-929c00660c52-0000 at executor(1)@10.3.1.8:58407
I0403 15:13:36.151674 11792 slave.cpp:923] Agent terminating
W0403 15:13:36.151674 11792 slave.cpp:3873] Ignoring shutdown framework c90b45e2-87e6-4830-9850-929c00660c52-0000
because it is terminating
I0403 15:13:36.152819 12064 master.cpp:10548] Removing task ce033352-3304-4c10-91be-ec51323bc780
with resources cpus(allocated: *):4; mem(allocated: *):2048; disk(allocated: *):1024; ports(allocated:
*):[31000-32000] of framework c90b45e2-87e6-4830-9850-929c00660c52-0000 on agent c90b45e2-87e6-4830-9850-929c00660c52-S0
at slave(418)@10.3.1.8:58386 (winbldsrv-01.zq4gs31qjdiunm1ryi1452nvnh.dx.internal.cloudapp.net)
I0403 15:13:36.155654 12716 containerizer.cpp:2338] Destroying container 390359d2-214f-4827-b98f-1945b7c32b5a
in RUNNING state
I0403 15:13:36.155654 12716 containerizer.cpp:2952] Transitioning the state of container 390359d2-214f-4827-b98f-1945b7c32b5a
from RUNNING to DESTROYING
I0403 15:13:36.156657 12064 master.cpp:1295] Agent c90b45e2-87e6-4830-9850-929c00660c52-S0
at slave(418)@10.3.1.8:58386 (winbldsrv-01.zq4gs31qjdiunm1ryi1452nvnh.dx.internal.cloudapp.net)
disconnected
I0403 15:13:36.156657  7872 hierarchical.cpp:344] Removed framework c90b45e2-87e6-4830-9850-929c00660c52-0000
I0403 15:13:36.156657 12064 master.cpp:3286] Disconnecting agent c90b45e2-87e6-4830-9850-929c00660c52-S0
at slave(418)@10.3.1.8:58386 (winbldsrv-01.zq4gs31qjdiunm1ryi1452nvnh.dx.internal.cloudapp.net)
I0403 15:13:36.156657 12064 master.cpp:3305] Deactivating agent c90b45e2-87e6-4830-9850-929c00660c52-S0
at slave(418)@10.3.1.8:58386 (winbldsrv-01.zq4gs31qjdiunm1ryi1452nvnh.dx.internal.cloudapp.net)
I0403 15:13:36.157655 12612 hierarchical.cpp:766] Agent c90b45e2-87e6-4830-9850-929c00660c52-S0
deactivated
I0403 15:13:36.157655 12716 launcher.cpp:156] Asked to destroy container 390359d2-214f-4827-b98f-1945b7c32b5a
I0403 15:13:36.251794  8452 containerizer.cpp:2791] Container 390359d2-214f-4827-b98f-1945b7c32b5a
has exited
I0403 15:13:36.283792  4160 master.cpp:1137] Master terminating
I0403 15:13:36.285816 12612 hierarchical.cpp:609] Removed agent c90b45e2-87e6-4830-9850-929c00660c52-S0
I0403 15:13:36.694824  1836 process.cpp:929] Stopped the socket accept loop
```

- Mesos Reviewbot Windows


On April 3, 2018, 2:11 p.m., David Forsythe wrote:
> 
> -----------------------------------------------------------
> This is an automatically generated e-mail. To reply, visit:
> https://reviews.apache.org/r/66392/
> -----------------------------------------------------------
> 
> (Updated April 3, 2018, 2:11 p.m.)
> 
> 
> Review request for mesos and Andrew Schwartzmeyer.
> 
> 
> Bugs: MESOS-4176
>     https://issues.apache.org/jira/browse/MESOS-4176
> 
> 
> Repository: mesos
> 
> 
> Description
> -------
> 
> Find sasl2 on non-Windows platforms before trying to link it.
> 
> 
> Diffs
> -----
> 
>   3rdparty/CMakeLists.txt 2b63b58f7d6a88c9986b746283dcfa79b7bcb270 
> 
> 
> Diff: https://reviews.apache.org/r/66392/diff/2/
> 
> 
> Testing
> -------
> 
> 
> Thanks,
> 
> David Forsythe
> 
>


Mime
  • Unnamed multipart/alternative (inline, None, 0 bytes)
View raw message