mesos-reviews mailing list archives

Site index · List index
Message view « Date » · « Thread »
Top « Date » · « Thread »
From Mesos Reviewbot Windows <revi...@mesos.apache.org>
Subject Re: Review Request 66387: Link subversion in stout build on FreeBSD.
Date Sun, 01 Apr 2018 04:23:55 GMT

-----------------------------------------------------------
This is an automatically generated e-mail. To reply, visit:
https://reviews.apache.org/r/66387/#review200268
-----------------------------------------------------------



FAIL: Some of the unit tests failed. Please check the relevant logs.

Reviews applied: `['66384', '66385', '66387']`

Failed command: `Start-MesosCITesting`

All the build artifacts available at: http://dcos-win.westus.cloudapp.azure.com/mesos-build/review/66387

Relevant logs:

- [mesos-tests-stdout.log](http://dcos-win.westus.cloudapp.azure.com/mesos-build/review/66387/logs/mesos-tests-stdout.log):

```
[       OK ] Endpoint/SlaveEndpointTest.NoAuthorizer/2 (113 ms)
[----------] 9 tests from Endpoint/SlaveEndpointTest (1083 ms total)

[----------] 2 tests from ContainerizerType/DefaultContainerDNSFlagTest
[ RUN      ] ContainerizerType/DefaultContainerDNSFlagTest.ValidateFlag/0
[       OK ] ContainerizerType/DefaultContainerDNSFlagTest.ValidateFlag/0 (34 ms)
[ RUN      ] ContainerizerType/DefaultContainerDNSFlagTest.ValidateFlag/1
[       OK ] ContainerizerType/DefaultContainerDNSFlagTest.ValidateFlag/1 (36 ms)
[----------] 2 tests from ContainerizerType/DefaultContainerDNSFlagTest (73 ms total)

[----------] 1 test from IsolationFlag/CpuIsolatorTest
[ RUN      ] IsolationFlag/CpuIsolatorTest.ROOT_UserCpuUsage/0
[       OK ] IsolationFlag/CpuIsolatorTest.ROOT_UserCpuUsage/0 (774 ms)
[----------] 1 test from IsolationFlag/CpuIsolatorTest (800 ms total)

[----------] 1 test from IsolationFlag/MemoryIsolatorTest
[ RUN      ] IsolationFlag/MemoryIsolatorTest.ROOT_MemUsage/0
[       OK ] IsolationFlag/MemoryIsolatorTest.ROOT_MemUsage/0 (838 ms)
[----------] 1 test from IsolationFlag/MemoryIsolatorTest (862 ms total)

[----------] Global test environment tear-down
[==========] 949 tests from 94 test cases ran. (454386 ms total)
[  PASSED  ] 948 tests.
[  FAILED  ] 1 test, listed below:
[  FAILED  ] CommandExecutorCheckTest.CommandCheckTimeout

 1 FAILED TEST
  YOU HAVE 214 DISABLED TESTS

```

- [mesos-tests-stderr.log](http://dcos-win.westus.cloudapp.azure.com/mesos-build/review/66387/logs/mesos-tests-stderr.log):

```
I0401 04:23:41.426841 11528 master.cpp:10446] Updating the state of task 3d17b279-0e4e-4f20-873f-a01c2345a0f6
of framework 799683fd-efcf-4e8e-be4d-3b3794881135-0000 (latest state: TASK_KILLED, status
update state: TASK_KILLED)
I040I0401 04:23:41.234832  3668 exec.cpp:162] Version: 1.6.0
I0401 04:23:41.262832  3640 exec.cpp:236] Executor registered on agent 799683fd-efcf-4e8e-be4d-3b3794881135-S0
I0401 04:23:41.266801  1912 executor.cpp:176] Received SUBSCRIBED event
I0401 04:23:41.272830  1912 executor.cpp:180] Subscribed executor on winbldsrv-01.zq4gs31qjdiunm1ryi1452nvnh.dx.internal.cloudapp.net
I0401 04:23:41.272830  1912 executor.cpp:176] Received LAUNCH event
I0401 04:23:41.278831  1912 executor.cpp:648] Starting task 3d17b279-0e4e-4f20-873f-a01c2345a0f6
I0401 04:23:41.366832  1912 executor.cpp:483] Running 'D:\DCOS\mesos\src\mesos-containerizer.exe
launch <POSSIBLY-SENSITIVE-DATA>'
I0401 04:23:41.397825  1912 executor.cpp:661] Forked command at 6172
I0401 04:23:41.428822  8668 exec.cpp:445] Executor asked to shutdown
I0401 04:23:41.429808 10704 executor.cpp:176] Received SHUTDOWN event
I0401 04:23:41.429808 10704 executor.cpp:758] Shutting down
I0401 04:23:41.429808 10704 executor.cpp:868] Sending SIGTERM to process tree at pid 61 04:23:41.426841
12060 slave.cpp:3877] Shutting down framework 799683fd-efcf-4e8e-be4d-3b3794881135-0000
I0401 04:23:41.427805 12060 slave.cpp:6570] Shutting down executor '3d17b279-0e4e-4f20-873f-a01c2345a0f6'
of framework 799683fd-efcf-4e8e-be4d-3b3794881135-0000 at executor(1)@10.3.1.8:64142
I0401 04:23:41.428822 12060 slave.cpp:923] Agent terminating
W0401 04:23:41.428822 12060 slave.cpp:3873] Ignoring shutdown framework 799683fd-efcf-4e8e-be4d-3b3794881135-0000
because it is terminating
I0401 04:23:41.428822 11528 master.cpp:10545] Removing task 3d17b279-0e4e-4f20-873f-a01c2345a0f6
with resources cpus(allocated: *):4; mem(allocated: *):2048; disk(allocated: *):1024; ports(allocated:
*):[31000-32000] of framework 799683fd-efcf-4e8e-be4d-3b3794881135-0000 on agent 799683fd-efcf-4e8e-be4d-3b3794881135-S0
at slave(418)@10.3.1.8:64121 (winbldsrv-01.zq4gs31qjdiunm1ryi1452nvnh.dx.internal.cloudapp.net)
I0401 04:23:41.431823 11528 master.cpp:1295] Agent 799683fd-efcf-4e8e-be4d-3b3794881135-S0
at slave(418)@10.3.1.8:64121 (winbldsrv-01.zq4gs31qjdiunm1ryi1452nvnh.dx.internal.cloudapp.net)
disconnected
I0401 04:23:41.431823 11528 master.cpp:3283] Disconnecting agent 799683fd-efcf-4e8e-be4d-3b3794881135-S0
at slave(418)@10.3.1.8:64121 (winbldsrv-01.zq4gs31qjdiunm1ryi1452nvnh.dx.internal.cloudapp.net)
I0401 04:23:41.432816 11528 master.cpp:3302] Deactivating agent 799683fd-efcf-4e8e-be4d-3b3794881135-S0
at slave(418)@10.3.1.8:64121 (winbldsrv-01.zq4gs31qjdiunm1ryi1452nvnh.dx.internal.cloudapp.net)
I0401 04:23:41.432816  8500 hierarchical.cpp:344] Removed framework 799683fd-efcf-4e8e-be4d-3b3794881135-0000
I0401 04:23:41.432816 10980 containerizer.cpp:2338] Destroying container 0b966e6e-a2ab-4b38-bcc6-ff112b6b8ccd
in RUNNING state
I0401 04:23:41.432816  8500 hierarchical.cpp:766] Agent 799683fd-efcf-4e8e-be4d-3b3794881135-S0
deactivated
I0401 04:23:41.433948 10980 containerizer.cpp:2952] Transitioning the state of container 0b966e6e-a2ab-4b38-bcc6-ff112b6b8ccd
from RUNNING to DESTROYING
I0401 04:23:41.433948 10980 launcher.cpp:156] Asked to destroy container 0b966e6e-a2ab-4b38-bcc6-ff112b6b8ccd
I0401 04:23:41.492307 11512 containerizer.cpp:2791] Container 0b966e6e-a2ab-4b38-bcc6-ff112b6b8ccd
has exited
I0401 04:23:41.526320 11700 master.cpp:1137] Master terminating
I0401 04:23:41.528301 12236 hierarchical.cpp:609] Removed agent 799683fd-efcf-4e8e-be4d-3b3794881135-S0
I0401 04:23:41.877501  3660 process.cpp:929] Stopped the socket accept loop
```

- Mesos Reviewbot Windows


On April 1, 2018, 3:25 a.m., David Forsythe wrote:
> 
> -----------------------------------------------------------
> This is an automatically generated e-mail. To reply, visit:
> https://reviews.apache.org/r/66387/
> -----------------------------------------------------------
> 
> (Updated April 1, 2018, 3:25 a.m.)
> 
> 
> Review request for mesos and Andrew Schwartzmeyer.
> 
> 
> Bugs: MESOS-4176
>     https://issues.apache.org/jira/browse/MESOS-4176
> 
> 
> Repository: mesos
> 
> 
> Description
> -------
> 
> Link subversion in stout build on FreeBSD.
> 
> 
> Diffs
> -----
> 
>   3rdparty/stout/CMakeLists.txt 5d787d87f0a4b30ba882b24d08118856eb84206b 
> 
> 
> Diff: https://reviews.apache.org/r/66387/diff/1/
> 
> 
> Testing
> -------
> 
> 
> Thanks,
> 
> David Forsythe
> 
>


Mime
  • Unnamed multipart/alternative (inline, None, 0 bytes)
View raw message