mesos-reviews mailing list archives

Site index · List index
Message view « Date » · « Thread »
Top « Date » · « Thread »
From Mesos Reviewbot Windows <revi...@mesos.apache.org>
Subject Re: Review Request 66235: Added a reference to MESOS-8557 to the default executor.
Date Mon, 26 Mar 2018 18:33:37 GMT

-----------------------------------------------------------
This is an automatically generated e-mail. To reply, visit:
https://reviews.apache.org/r/66235/#review199986
-----------------------------------------------------------



FAIL: Some of the unit tests failed. Please check the relevant logs.

Reviews applied: `['65692', '65693', '66232', '65694', '66233', '65962', '66234', '66235']`

Failed command: `Start-MesosCITesting`

All the build artifacts available at: http://dcos-win.westus.cloudapp.azure.com/mesos-build/review/66235

Relevant logs:

- [mesos-tests-stdout.log](http://dcos-win.westus.cloudapp.azure.com/mesos-build/review/66235/logs/mesos-tests-stdout.log):

```
[       OK ] Endpoint/SlaveEndpointTest.NoAuthorizer/2 (108 ms)
[----------] 9 tests from Endpoint/SlaveEndpointTest (1051 ms total)

[----------] 2 tests from ContainerizerType/DefaultContainerDNSFlagTest
[ RUN      ] ContainerizerType/DefaultContainerDNSFlagTest.ValidateFlag/0
[       OK ] ContainerizerType/DefaultContainerDNSFlagTest.ValidateFlag/0 (33 ms)
[ RUN      ] ContainerizerType/DefaultContainerDNSFlagTest.ValidateFlag/1
[       OK ] ContainerizerType/DefaultContainerDNSFlagTest.ValidateFlag/1 (37 ms)
[----------] 2 tests from ContainerizerType/DefaultContainerDNSFlagTest (72 ms total)

[----------] 1 test from IsolationFlag/CpuIsolatorTest
[ RUN      ] IsolationFlag/CpuIsolatorTest.ROOT_UserCpuUsage/0
[       OK ] IsolationFlag/CpuIsolatorTest.ROOT_UserCpuUsage/0 (836 ms)
[----------] 1 test from IsolationFlag/CpuIsolatorTest (861 ms total)

[----------] 1 test from IsolationFlag/MemoryIsolatorTest
[ RUN      ] IsolationFlag/MemoryIsolatorTest.ROOT_MemUsage/0
[       OK ] IsolationFlag/MemoryIsolatorTest.ROOT_MemUsage/0 (838 ms)
[----------] 1 test from IsolationFlag/MemoryIsolatorTest (866 ms total)

[----------] Global test environment tear-down
[==========] 949 tests from 94 test cases ran. (453760 ms total)
[  PASSED  ] 948 tests.
[  FAILED  ] 1 test, listed below:
[  FAILED  ] CommandExecutorCheckTest.CommandCheckTimeout

 1 FAILED TEST
  YOU HAVE 214 DISABLED TESTS

```

- [mesos-tests-stderr.log](http://dcos-win.westus.cloudapp.azure.com/mesos-build/review/66235/logs/mesos-tests-stderr.log):

```
I0326 18:33:21.498932  6736 executor.cpp:176] Received SUBSCRIBED event
I0326 18:33:21.503933  6736 executor.cpp:180] Subscribed executor on winbldsrv-01.zq4gs31qjdiunm1ryi1452nvnh.dx.internal.cloudapp.net
I0326 18:33:21.503933  6736 executor.cpp:176] Received LAUNCH event
I0326 18:33:21.508934  6736 executor.cpp:648] Starting task 5d87495d-e6e5-48aa-b625-a86a126651e0
I0326 18:33:21.589933  6736 executor.cpp:483] Running 'D:\DCOS\mesos\src\mesos-containerizer.exe
launch <POSSIBLY-SENSITIVE-DATA>'
I0326 18:33:21.622939  6736 executor.cpp:661] Forked command at 9980
I0326 18:33:21.650974  9004 exec.cpp:445] Executor asked to shutdown
I0326 18:33:21.651959  8528 executor.cpp:176] Received SHUTDOWN event
I0326 18:33:21.651959  8528 executor.cpp:758] Shutting down
I0326 18:33:21.651959  8528 executor.cpp:868] Sending SIGTERM to process tree at pid 9t) at
scheduler-493e88dc-b87f-4db7-bd77-fc9815f68bb5@10.3.1.8:60074
I0326 18:33:21.649966 14180 hierarchical.cpp:405] Deactivated framework 7254f1bf-b053-494f-8f37-6e63c1029f44-0000
I0326 18:33:21.649966  7788 master.cpp:10446] Updating the state of task 5d87495d-e6e5-48aa-b625-a86a126651e0
of framework 7254f1bf-b053-494f-8f37-6e63c1029f44-0000 (latest state: TASK_KILLED, status
update state: TASK_KILLED)
I0326 18:33:21.649966  6336 slave.cpp:3873] Shutting down framework 7254f1bf-b053-494f-8f37-6e63c1029f44-0000
I0326 18:33:21.649966  6336 slave.cpp:6566] Shutting down executor '5d87495d-e6e5-48aa-b625-a86a126651e0'
of framework 7254f1bf-b053-494f-8f37-6e63c1029f44-0000 at executor(1)@10.3.1.8:60095
I0326 18:33:21.650974  3340 slave.cpp:919] Agent terminating
W0326 18:33:21.650974  3340 slave.cpp:3869] Ignoring shutdown framework 7254f1bf-b053-494f-8f37-6e63c1029f44-0000
because it is terminating
I0326 18:33:21.651959  7788 master.cpp:10545] Removing task 5d87495d-e6e5-48aa-b625-a86a126651e0
with resources cpus(allocated: *):4; mem(allocated: *):2048; disk(allocated: *):1024; ports(allocated:
*):[31000-32000] of framework 7254f1bf-b053-494f-8f37-6e63c1029f44-0000 on agent 7254f1bf-b053-494f-8f37-6e63c1029f44-S0
at slave(418)@10.3.1.8:60074 (winbldsrv-01.zq4gs31qjdiunm1ryi1452nvnh.dx.internal.cloudapp.net)
I0326 18:33:21.654940 12468 containerizer.cpp:2338] Destroying container 8e4105fd-d9b4-4aab-aa69-f68d3f1e4dc7
in RUNNING state
I0326 18:33:21.654940 12468 containerizer.cpp:2952] Transitioning the state of container 8e4105fd-d9b4-4aab-aa69-f68d3f1e4dc7
from RUNNING to DESTROYING
I0326 18:33:21.654940  7788 master.cpp:1295] Agent 7254f1bf-b053-494f-8f37-6e63c1029f44-S0
at slave(418)@10.3.1.8:60074 (winbldsrv-01.zq4gs31qjdiunm1ryi1452nvnh.dx.internal.cloudapp.net)
disconnected
I0326 18:33:21.655972  7788 master.cpp:3283] Disconnecting agent 7254f1bf-b053-494f-8f37-6e63c1029f44-S0
at slave(418)@10.3.1.8:60074 (winbldsrv-01.zq4gs31qjdiunm1ryi1452nvnh.dx.internal.cloudapp.net)
I0326 18:33:21.655972 12468 launcher.cpp:156] Asked to destroy container 8e4105fd-d9b4-4aab-aa69-f68d3f1e4dc7
I0326 18:33:21.655972  7788 master.cpp:3302] Deactivating agent 7254f1bf-b053-494f-8f37-6e63c1029f44-S0
at slave(418)@10.3.1.8:60074 (winbldsrv-01.zq4gs31qjdiunm1ryi1452nvnh.dx.internal.cloudapp.net)
I0326 18:33:21.657939  8484 hierarchical.cpp:344] Removed framework 7254f1bf-b053-494f-8f37-6e63c1029f44-0000
I0326 18:33:21.657939  8484 hierarchical.cpp:766] Agent 7254f1bf-b053-494f-8f37-6e63c1029f44-S0
deactivated
I0326 18:33:21.728466 14144 containerizer.cpp:2791] Container 8e4105fd-d9b4-4aab-aa69-f68d3f1e4dc7
has exited
I0326 18:33:21.760460  3340 master.cpp:1137] Master terminating
I0326 18:33:21.763468 12752 hierarchical.cpp:609] Removed agent 7254f1bf-b053-494f-8f37-6e63c1029f44-S0
I0326 18:33:22.152483  4324 process.cpp:929] Stopped the socket accept loop
```

- Mesos Reviewbot Windows


On March 26, 2018, 5:40 p.m., Gaston Kleiman wrote:
> 
> -----------------------------------------------------------
> This is an automatically generated e-mail. To reply, visit:
> https://reviews.apache.org/r/66235/
> -----------------------------------------------------------
> 
> (Updated March 26, 2018, 5:40 p.m.)
> 
> 
> Review request for mesos and Alexander Rukletsov.
> 
> 
> Bugs: MESOS-8557
>     https://issues.apache.org/jira/browse/MESOS-8557
> 
> 
> Repository: mesos
> 
> 
> Description
> -------
> 
> Added a reference to MESOS-8557 to the default executor.
> 
> 
> Diffs
> -----
> 
>   src/launcher/default_executor.cpp 906836f3b8e0af79d7c61f90fd8a95f193b26e84 
> 
> 
> Diff: https://reviews.apache.org/r/66235/diff/2/
> 
> 
> Testing
> -------
> 
> 
> Thanks,
> 
> Gaston Kleiman
> 
>


Mime
  • Unnamed multipart/alternative (inline, None, 0 bytes)
View raw message