mesos-reviews mailing list archives

Site index · List index
Message view « Date » · « Thread »
Top « Date » · « Thread »
From Mesos Reviewbot Windows <revi...@mesos.apache.org>
Subject Re: Review Request 64211: Added options to build the Python CLI and run unit tests.
Date Mon, 26 Mar 2018 01:43:31 GMT

-----------------------------------------------------------
This is an automatically generated e-mail. To reply, visit:
https://reviews.apache.org/r/64211/#review199936
-----------------------------------------------------------



FAIL: Some of the unit tests failed. Please check the relevant logs.

Reviews applied: `['65585', '65705', '64211']`

Failed command: `Start-MesosCITesting`

All the build artifacts available at: http://dcos-win.westus.cloudapp.azure.com/mesos-build/review/64211

Relevant logs:

- [mesos-tests-stdout.log](http://dcos-win.westus.cloudapp.azure.com/mesos-build/review/64211/logs/mesos-tests-stdout.log):

```
[       OK ] Endpoint/SlaveEndpointTest.NoAuthorizer/2 (116 ms)
[----------] 9 tests from Endpoint/SlaveEndpointTest (1046 ms total)

[----------] 2 tests from ContainerizerType/DefaultContainerDNSFlagTest
[ RUN      ] ContainerizerType/DefaultContainerDNSFlagTest.ValidateFlag/0
[       OK ] ContainerizerType/DefaultContainerDNSFlagTest.ValidateFlag/0 (32 ms)
[ RUN      ] ContainerizerType/DefaultContainerDNSFlagTest.ValidateFlag/1
[       OK ] ContainerizerType/DefaultContainerDNSFlagTest.ValidateFlag/1 (38 ms)
[----------] 2 tests from ContainerizerType/DefaultContainerDNSFlagTest (71 ms total)

[----------] 1 test from IsolationFlag/CpuIsolatorTest
[ RUN      ] IsolationFlag/CpuIsolatorTest.ROOT_UserCpuUsage/0
[       OK ] IsolationFlag/CpuIsolatorTest.ROOT_UserCpuUsage/0 (734 ms)
[----------] 1 test from IsolationFlag/CpuIsolatorTest (756 ms total)

[----------] 1 test from IsolationFlag/MemoryIsolatorTest
[ RUN      ] IsolationFlag/MemoryIsolatorTest.ROOT_MemUsage/0
[       OK ] IsolationFlag/MemoryIsolatorTest.ROOT_MemUsage/0 (738 ms)
[----------] 1 test from IsolationFlag/MemoryIsolatorTest (760 ms total)

[----------] Global test environment tear-down
[==========] 949 tests from 94 test cases ran. (434580 ms total)
[  PASSED  ] 948 tests.
[  FAILED  ] 1 test, listed below:
[  FAILED  ] CommandExecutorCheckTest.CommandCheckTimeout

 1 FAILED TEST
  YOU HAVE 215 DISABLED TESTS

```

- [mesos-tests-stderr.log](http://dcos-win.westus.cloudapp.azure.com/mesos-build/review/64211/logs/mesos-tests-stderr.log):

```
I0326 01:43:17.675281  4792 slave.cpp:3873] Shutting down framework cf776596-6c39-4a66-8b1e-05cf125e516b-0000
I0326 01:43:17.675281  9868 master.cpp:10446] Updating the state of task 137755f4-adeb-4e6d-b26c-275f9f78c402
of framework cf776596-6c39-4a66-8b1e-05cf125e516b-0000 (latest state: TASK_KILLED, status
update state: TASK_KILLED)
I0326 01:43:17.676281  4792 slave.cpp:6566] Shutting down executor '137755f4-adeb-4e6d-b26c-275I0326
01:43:17.489310  8832 exec.cpp:162] Version: 1.6.0
I0326 01:43:17.516294 10184 exec.cpp:236] Executor registered on agent cf776596-6c39-4a66-8b1e-05cf125e516b-S0
I0326 01:43:17.520313 10024 executor.cpp:176] Received SUBSCRIBED event
I0326 01:43:17.525290 10024 executor.cpp:180] Subscribed executor on winbldsrv-02.zq4gs31qjdiunm1ryi1452nvnh.dx.internal.cloudapp.net
I0326 01:43:17.526291 10024 executor.cpp:176] Received LAUNCH event
I0326 01:43:17.532285 10024 executor.cpp:648] Starting task 137755f4-adeb-4e6d-b26c-275f9f78c402
I0326 01:43:17.618286 10024 executor.cpp:483] Running 'D:\DCOS\mesos\src\mesos-containerizer.exe
launch <POSSIBLY-SENSITIVE-DATA>'
I0326 01:43:17.648293 10024 executor.cpp:661] Forked command at 7564
I0326 01:43:17.678280  5964 exec.cpp:445] Executor asked to shutdown
I0326 01:43:17.679278  9712 executor.cpp:176] Received SHUTDOWN event
I0326 01:43:17.679278  9712 executor.cpp:758] Shutting down
I0326 01:43:17.679278  9712 executor.cpp:868] Sending SIGTERM to process tree at pid 7f9f78c402'
of framework cf776596-6c39-4a66-8b1e-05cf125e516b-0000 at executor(1)@10.3.1.5:57572
I0326 01:43:17.678280  7308 slave.cpp:919] Agent terminating
W0326 01:43:17.678280  7308 slave.cpp:3869] Ignoring shutdown framework cf776596-6c39-4a66-8b1e-05cf125e516b-0000
because it is terminating
I0326 01:43:17.679278  9868 master.cpp:10545] Removing task 137755f4-adeb-4e6d-b26c-275f9f78c402
with resources cpus(allocated: *):4; mem(allocated: *):2048; disk(allocated: *):1024; ports(allocated:
*):[31000-32000] of framework cf776596-6c39-4a66-8b1e-05cf125e516b-0000 on agent cf776596-6c39-4a66-8b1e-05cf125e516b-S0
at slave(418)@10.3.1.5:57551 (winbldsrv-02.zq4gs31qjdiunm1ryi1452nvnh.dx.internal.cloudapp.net)
I0326 01:43:17.682298  3140 containerizer.cpp:2338] Destroying container 70158979-32e7-4571-92e0-2ad6d21b826d
in RUNNING state
I0326 01:43:17.682298  3140 containerizer.cpp:2952] Transitioning the state of container 70158979-32e7-4571-92e0-2ad6d21b826d
from RUNNING to DESTROYING
I0326 01:43:17.682298  9868 master.cpp:1295] Agent cf776596-6c39-4a66-8b1e-05cf125e516b-S0
at slave(418)@10.3.1.5:57551 (winbldsrv-02.zq4gs31qjdiunm1ryi1452nvnh.dx.internal.cloudapp.net)
disconnected
I0326 01:43:17.683315  9868 master.cpp:3283] Disconnecting agent cf776596-6c39-4a66-8b1e-05cf125e516b-S0
at slave(418)@10.3.1.5:57551 (winbldsrv-02.zq4gs31qjdiunm1ryi1452nvnh.dx.internal.cloudapp.net)
I0326 01:43:17.683315  3140 launcher.cpp:156] Asked to destroy container 70158979-32e7-4571-92e0-2ad6d21b826d
I0326 01:43:17.683315  9868 master.cpp:3302] Deactivating agent cf776596-6c39-4a66-8b1e-05cf125e516b-S0
at slave(418)@10.3.1.5:57551 (winbldsrv-02.zq4gs31qjdiunm1ryi1452nvnh.dx.internal.cloudapp.net)
I0326 01:43:17.683315  9124 hierarchical.cpp:344] Removed framework cf776596-6c39-4a66-8b1e-05cf125e516b-0000
I0326 01:43:17.683315  9124 hierarchical.cpp:766] Agent cf776596-6c39-4a66-8b1e-05cf125e516b-S0
deactivated
I0326 01:43:17.687299  8028 containerizer.cpp:2791] Container 70158979-32e7-4571-92e0-2ad6d21b826d
has exited
I0326 01:43:17.720312  7308 master.cpp:1137] Master terminating
I0326 01:43:17.723309  9868 hierarchical.cpp:609] Removed agent cf776596-6c39-4a66-8b1e-05cf125e516b-S0
I0326 01:43:18.161348  3580 process.cpp:929] Stopped the socket accept loop
```

- Mesos Reviewbot Windows


On March 24, 2018, 11:39 a.m., Armand Grillet wrote:
> 
> -----------------------------------------------------------
> This is an automatically generated e-mail. To reply, visit:
> https://reviews.apache.org/r/64211/
> -----------------------------------------------------------
> 
> (Updated March 24, 2018, 11:39 a.m.)
> 
> 
> Review request for mesos, Benjamin Bannier and Kevin Klues.
> 
> 
> Bugs: MESOS-8240
>     https://issues.apache.org/jira/browse/MESOS-8240
> 
> 
> Repository: mesos
> 
> 
> Description
> -------
> 
> An update of the discarded review /r/52543.
> 
> Works with Autotools and CMake.
> 
> 
> Diffs
> -----
> 
>   CMakeLists.txt 6702f02245e3867c06bbd9efbbf4e3b961a7d9aa 
>   cmake/CompilationConfigure.cmake 64cc56ee4208afe05df0f28af5890157e4c7d82c 
>   configure.ac f0f901f2e565352c2804cae7b2ac255da81ce45d 
>   docs/configuration/cmake.md 1e34657ea55fa324f65f865f7d0a67084c6719d9 
>   src/CMakeLists.txt 3b04e6353979c05a38f1b032704dce566d8fd561 
>   src/Makefile.am a570c9f47f6de73c689930ae020fefb29b30b32d 
>   src/python/cli_new/CMakeLists.txt PRE-CREATION 
>   src/python/cli_new/tests/CMakeLists.txt PRE-CREATION 
> 
> 
> Diff: https://reviews.apache.org/r/64211/diff/16/
> 
> 
> Testing
> -------
> 
> Testing done on Fedora 25.
> 
> For Autotools:
> ```
> $ ./bootstrap
> $ mkdir build
> $ cd build
> $ ../configure --enable-new-cli --disable-java --disable-python
> $ make check
> ```
> 
> For CMake:
> ```
> $ ./bootstrap
> $ mkdir build
> $ cd build
> $ cmake .. -DENABLE_NEW_CLI=1
> $ cmake --build . -- -j16
> $ ./src/mesos
> Mesos CLI
> 
> Usage:
>   mesos (-h | --help)
>   mesos --version
>   mesos <command> [<args>...]
> 
> Options:
>   -h --help  Show this screen.
>   --version  Show version info.
> 
> Commands:
>   agent   Interacts with the Mesos agents
>   config  Interacts with the Mesos CLI configuration file
>   task    Interacts with the tasks running in a Mesos cluster
> 
> See 'mesos help <command>' for more information on a specific command.
> $ cmake --build . --target tests -- -j16
> $ ctest -R CLI
> Test project /home/agrillet/apache-mesos/build
>     Start 4: CLITests
> 1/1 Test #4: CLITests .........................   Passed    3.63 sec
> 
> 100% tests passed, 0 tests failed out of 1
> ```
> 
> Checked that the the CLI tests were run, that the content of the directory `build/src/cli`
was as expected, and that `build/src/mesos` was correctly running.
> 
> 
> Thanks,
> 
> Armand Grillet
> 
>


Mime
  • Unnamed multipart/alternative (inline, None, 0 bytes)
View raw message