mesos-reviews mailing list archives

Site index · List index
Message view « Date » · « Thread »
Top « Date » · « Thread »
From Mesos Reviewbot Windows <revi...@mesos.apache.org>
Subject Re: Review Request 66037: Enabled agent resource provider capability by default.
Date Fri, 23 Mar 2018 17:53:34 GMT

-----------------------------------------------------------
This is an automatically generated e-mail. To reply, visit:
https://reviews.apache.org/r/66037/#review199900
-----------------------------------------------------------



FAIL: Some of the unit tests failed. Please check the relevant logs.

Reviews applied: `['66037']`

Failed command: `Start-MesosCITesting`

All the build artifacts available at: http://dcos-win.westus.cloudapp.azure.com/mesos-build/review/66037

Relevant logs:

- [mesos-tests-stdout.log](http://dcos-win.westus.cloudapp.azure.com/mesos-build/review/66037/logs/mesos-tests-stdout.log):

```
[       OK ] Endpoint/SlaveEndpointTest.NoAuthorizer/2 (107 ms)
[----------] 9 tests from Endpoint/SlaveEndpointTest (995 ms total)

[----------] 2 tests from ContainerizerType/DefaultContainerDNSFlagTest
[ RUN      ] ContainerizerType/DefaultContainerDNSFlagTest.ValidateFlag/0
[       OK ] ContainerizerType/DefaultContainerDNSFlagTest.ValidateFlag/0 (32 ms)
[ RUN      ] ContainerizerType/DefaultContainerDNSFlagTest.ValidateFlag/1
[       OK ] ContainerizerType/DefaultContainerDNSFlagTest.ValidateFlag/1 (39 ms)
[----------] 2 tests from ContainerizerType/DefaultContainerDNSFlagTest (73 ms total)

[----------] 1 test from IsolationFlag/CpuIsolatorTest
[ RUN      ] IsolationFlag/CpuIsolatorTest.ROOT_UserCpuUsage/0
[       OK ] IsolationFlag/CpuIsolatorTest.ROOT_UserCpuUsage/0 (788 ms)
[----------] 1 test from IsolationFlag/CpuIsolatorTest (808 ms total)

[----------] 1 test from IsolationFlag/MemoryIsolatorTest
[ RUN      ] IsolationFlag/MemoryIsolatorTest.ROOT_MemUsage/0
[       OK ] IsolationFlag/MemoryIsolatorTest.ROOT_MemUsage/0 (844 ms)
[----------] 1 test from IsolationFlag/MemoryIsolatorTest (864 ms total)

[----------] Global test environment tear-down
[==========] 949 tests from 94 test cases ran. (444603 ms total)
[  PASSED  ] 948 tests.
[  FAILED  ] 1 test, listed below:
[  FAILED  ] CommandExecutorCheckTest.CommandCheckTimeout

 1 FAILED TEST
  YOU HAVE 215 DISABLED TESTS

```

- [mesos-tests-stderr.log](http://dcos-win.westus.cloudapp.azure.com/mesos-build/review/66037/logs/mesos-tests-stderr.log):

```
I0323 17:53:19.197788  1636 master.cpp:10446] Updating the state of task 2f6cc332-5b9f-4265-be86-93afde624a59
of framework 70c7fb63-a527-4f24-85c0-e374f56eec71-0000 (latest state: TASK_KILLED, status
update state: TASK_KILLED)
I0323 17:53:19.197788  6416 slave.cpp:3873] Shutting down framework 70c7fb63-a527-4f24-85c0-e374f56eec71-0000
I0323 17:53:19.199072  6416 slave.cpp:6566] Shutting down executor '2f6cc332-5b9f-4265-be86-93afde624a59'
of framework 70c7fb63-a527-4f24-85c0-e374f56eec71-0000 at executor(1)@10.3.1.5:52025
I0323 17:53:19.200773  6416 slave.cpp:919] Agent terminating
I0323 17:53:19.200773  1636 master.cpp:10545] Removing task 2f6cc332-5b9f-4265-be86-93afde624a59
with resources cpus(allocated: *):4; mem(allocated: *):2048; disk(allocated: *):1024; ports(allocated:
*):[31000-32000] of framework 70cI0323 17:53:19.002023  7080 exec.cpp:162] Version: 1.6.0
I0323 17:53:19.029784  5744 exec.cpp:236] Executor registered on agent 70c7fb63-a527-4f24-85c0-e374f56eec71-S0
I0323 17:53:19.034785  8864 executor.cpp:176] Received SUBSCRIBED event
I0323 17:53:19.038785  8864 executor.cpp:180] Subscribed executor on winbldsrv-02.zq4gs31qjdiunm1ryi1452nvnh.dx.internal.cloudapp.net
I0323 17:53:19.039785  8864 executor.cpp:176] Received LAUNCH event
I0323 17:53:19.044785  8864 executor.cpp:648] Starting task 2f6cc332-5b9f-4265-be86-93afde624a59
I0323 17:53:19.133824  8864 executor.cpp:483] Running 'D:\DCOS\mesos\src\mesos-containerizer.exe
launch <POSSIBLY-SENSITIVE-DATA>'
I0323 17:53:19.161787  8864 executor.cpp:661] Forked command at 2528
I0323 17:53:19.201773  7032 exec.cpp:445] Executor asked to shutdown
I0323 17:53:19.201773  8084 executor.cpp:176] Received SHUTDOWN event
I0323 17:53:19.201773  8084 executor.cpp:758] Shutting down
I0323 17:53:19.201773  8084 executor.cpp:868] Sending SIGTERM to process tree at pid 27fb63-a527-4f24-85c0-e374f56eec71-0000
on agent 70c7fb63-a527-4f24-85c0-e374f56eec71-S0 at slave(418)@10.3.1.5:52004 (winbldsrv-02.zq4gs31qjdiunm1ryi1452nvnh.dx.internal.cloudapp.net)
W0323 17:53:19.200773  6416 slave.cpp:3869] Ignoring shutdown framework 70c7fb63-a527-4f24-85c0-e374f56eec71-0000
because it is terminating
I0323 17:53:19.203778  1636 master.cpp:1295] Agent 70c7fb63-a527-4f24-85c0-e374f56eec71-S0
at slave(418)@10.3.1.5:52004 (winbldsrv-02.zq4gs31qjdiunm1ryi1452nvnh.dx.internal.cloudapp.net)
disconnected
I0323 17:53:19.203778  1636 master.cpp:3283] Disconnecting agent 70c7fb63-a527-4f24-85c0-e374f56eec71-S0
at slave(418)@10.3.1.5:52004 (winbldsrv-02.zq4gs31qjdiunm1ryi1452nvnh.dx.internal.cloudapp.net)
I0323 17:53:19.204780  1636 master.cpp:3302] Deactivating agent 70c7fb63-a527-4f24-85c0-e374f56eec71-S0
at slave(418)@10.3.1.5:52004 (winbldsrv-02.zq4gs31qjdiunm1ryi1452nvnh.dx.internal.cloudapp.net)
I0323 17:53:19.204780  8348 containerizer.cpp:2338] Destroying container f687c34d-d387-4641-b5d2-31ddb5a84b8a
in RUNNING state
I0323 17:53:19.204780  1632 hierarchical.cpp:344] Removed framework 70c7fb63-a527-4f24-85c0-e374f56eec71-0000
I0323 17:53:19.205795  8348 containerizer.cpp:2952] Transitioning the state of container f687c34d-d387-4641-b5d2-31ddb5a84b8a
from RUNNING to DESTROYING
I0323 17:53:19.205795  1632 hierarchical.cpp:766] Agent 70c7fb63-a527-4f24-85c0-e374f56eec71-S0
deactivated
I0323 17:53:19.205795  8348 launcher.cpp:156] Asked to destroy container f687c34d-d387-4641-b5d2-31ddb5a84b8a
I0323 17:53:19.310585  2128 containerizer.cpp:2791] Container f687c34d-d387-4641-b5d2-31ddb5a84b8a
has exited
I0323 17:53:19.342588  8372 master.cpp:1137] Master terminating
I0323 17:53:19.344549  8276 hierarchical.cpp:609] Removed agent 70c7fb63-a527-4f24-85c0-e374f56eec71-S0
I0323 17:53:19.767558  5964 process.cpp:929] Stopped the socket accept loop
```

- Mesos Reviewbot Windows


On March 23, 2018, 8:07 a.m., Benjamin Bannier wrote:
> 
> -----------------------------------------------------------
> This is an automatically generated e-mail. To reply, visit:
> https://reviews.apache.org/r/66037/
> -----------------------------------------------------------
> 
> (Updated March 23, 2018, 8:07 a.m.)
> 
> 
> Review request for mesos, Gaston Kleiman, Jie Yu, and Jan Schlicht.
> 
> 
> Bugs: MESOS-8647
>     https://issues.apache.org/jira/browse/MESOS-8647
> 
> 
> Repository: mesos
> 
> 
> Description
> -------
> 
> This patch add `RESOURCE_PROVIDER` to the list of default-enabled
> agent capabilities. In addition we also adjust tests to accommodate
> the change in the agent registration protocol this triggers. We rely
> on masters ignoring redundant `UpdateSlaveMessage`s.
> 
> 
> Diffs
> -----
> 
>   src/slave/constants.cpp 9b60bd0e808aab272039239db95bee71a3d910ab 
>   src/tests/agent_resource_provider_config_api_tests.cpp bd5312b71f500a3572362a39f22d742c621762cf

>   src/tests/api_tests.cpp 7e9233eae8d06a2513f71a17c429d04b9017154c 
>   src/tests/master_tests.cpp 85a509a14d1e96f10b65d7df854cf83de3fa48f6 
>   src/tests/oversubscription_tests.cpp 564405743cbf5805e79c04c7b37df505e988d984 
>   src/tests/persistent_volume_endpoints_tests.cpp b9dbb96da5dc89b658f1618fb3a8b2fcc6b9f1b9

>   src/tests/persistent_volume_tests.cpp 924d8458e54e34a49c99593482b5908c5f7c7a48 
>   src/tests/reservation_endpoints_tests.cpp 51146ea04fcd04efd489386be861415e2a066606

>   src/tests/reservation_tests.cpp 8d8e9c8390e65187269bd194bb322bbdff88e0bd 
>   src/tests/resource_provider_manager_tests.cpp 718436e1c62ba3115a4408540b8d745a6f48cbfe

>   src/tests/scheduler_tests.cpp 1b9b39f7bf6ed69a4fd7a6c4735f55c53aaf6140 
>   src/tests/slave_recovery_tests.cpp 4a5860c37c63ae1338734e62db2066033e899fc9 
>   src/tests/slave_tests.cpp 028cd32c7043eba4e6f2045956471bd0bf42371c 
>   src/tests/storage_local_resource_provider_tests.cpp 49aa4ffa0d518c49f6061d572d8c7900c31600a4

>   support/mesos-mini/Dockerfile f9bcdb59d233ddfa0a4523c84057c630d1d636a0 
>   support/mesos-mini/mesos/agent_features.json a66852aff91e4b0c9ea996123cb6466a5ee0a050

> 
> 
> Diff: https://reviews.apache.org/r/66037/diff/4/
> 
> 
> Testing
> -------
> 
> `sudo make check`
> 
> 
> Thanks,
> 
> Benjamin Bannier
> 
>


Mime
  • Unnamed multipart/alternative (inline, None, 0 bytes)
View raw message