mesos-reviews mailing list archives

Site index · List index
Message view « Date » · « Thread »
Top « Date » · « Thread »
From Mesos Reviewbot Windows <revi...@mesos.apache.org>
Subject Re: Review Request 66248: Re-enabled SlaveTest.ChangeDomain.
Date Fri, 23 Mar 2018 15:36:22 GMT

-----------------------------------------------------------
This is an automatically generated e-mail. To reply, visit:
https://reviews.apache.org/r/66248/#review199889
-----------------------------------------------------------



FAIL: Some of the unit tests failed. Please check the relevant logs.

Reviews applied: `['66248']`

Failed command: `Start-MesosCITesting`

All the build artifacts available at: http://dcos-win.westus.cloudapp.azure.com/mesos-build/review/66248

Relevant logs:

- [mesos-tests-stdout.log](http://dcos-win.westus.cloudapp.azure.com/mesos-build/review/66248/logs/mesos-tests-stdout.log):

```
[       OK ] Endpoint/SlaveEndpointTest.NoAuthorizer/2 (108 ms)
[----------] 9 tests from Endpoint/SlaveEndpointTest (1006 ms total)

[----------] 2 tests from ContainerizerType/DefaultContainerDNSFlagTest
[ RUN      ] ContainerizerType/DefaultContainerDNSFlagTest.ValidateFlag/0
[       OK ] ContainerizerType/DefaultContainerDNSFlagTest.ValidateFlag/0 (33 ms)
[ RUN      ] ContainerizerType/DefaultContainerDNSFlagTest.ValidateFlag/1
[       OK ] ContainerizerType/DefaultContainerDNSFlagTest.ValidateFlag/1 (40 ms)
[----------] 2 tests from ContainerizerType/DefaultContainerDNSFlagTest (74 ms total)

[----------] 1 test from IsolationFlag/CpuIsolatorTest
[ RUN      ] IsolationFlag/CpuIsolatorTest.ROOT_UserCpuUsage/0
[       OK ] IsolationFlag/CpuIsolatorTest.ROOT_UserCpuUsage/0 (801 ms)
[----------] 1 test from IsolationFlag/CpuIsolatorTest (821 ms total)

[----------] 1 test from IsolationFlag/MemoryIsolatorTest
[ RUN      ] IsolationFlag/MemoryIsolatorTest.ROOT_MemUsage/0
[       OK ] IsolationFlag/MemoryIsolatorTest.ROOT_MemUsage/0 (848 ms)
[----------] 1 test from IsolationFlag/MemoryIsolatorTest (869 ms total)

[----------] Global test environment tear-down
[==========] 950 tests from 94 test cases ran. (448296 ms total)
[  PASSED  ] 949 tests.
[  FAILED  ] 1 test, listed below:
[  FAILED  ] CommandExecutorCheckTest.CommandCheckTimeout

 1 FAILED TEST
  YOU HAVE 214 DISABLED TESTS

```

- [mesos-tests-stderr.log](http://dcos-win.westus.cloudapp.azure.com/mesos-build/review/66248/logs/mesos-tests-stderr.log):

```
I0323 15:36:08.784561  7204 master.cpp:10446] Updating the state of task a217832c-4522-4a9d-9599-62cc6013fed2
of framework f6a4244b-b920-4fI0323 15:36:08.590553  3776 exec.cpp:162] Version: 1.6.0
I0323 15:36:08.621620  2824 exec.cpp:236] Executor registered on agent f6a4244b-b920-4ff5-94c9-2611a24dcbcf-S0
I0323 15:36:08.626600  8988 executor.cpp:176] Received SUBSCRIBED event
I0323 15:36:08.630599  8988 executor.cpp:180] Subscribed executor on winbldsrv-02.zq4gs31qjdiunm1ryi1452nvnh.dx.internal.cloudapp.net
I0323 15:36:08.630599  8988 executor.cpp:176] Received LAUNCH event
I0323 15:36:08.636613  8988 executor.cpp:648] Starting task a217832c-4522-4a9d-9599-62cc6013fed2
I0323 15:36:08.721614  8988 executor.cpp:483] Running 'D:\DCOS\mesos\src\mesos-containerizer.exe
launch <POSSIBLY-SENSITIVE-DATA>'
I0323 15:36:08.754616  8988 executor.cpp:661] Forked command at 8328
I0323 15:36:08.786633  8556 exec.cpp:445] Executor asked to shutdown
I0323 15:36:08.787554  7424 executor.cpp:176] Received SHUTDOWN event
I0323 15:36:08.787554  7424 executor.cpp:758] Shutting down
I0323 15:36:08.787554  7424 executor.cpp:868] Sending SIGTERM to process tree at pid 8f5-94c9-2611a24dcbcf-0000
(latest state: TASK_KILLED, status update state: TASK_KILLED)
I0323 15:36:08.784561  2244 slave.cpp:3873] Shutting down framework f6a4244b-b920-4ff5-94c9-2611a24dcbcf-0000
I0323 15:36:08.785560  2244 slave.cpp:6566] Shutting down executor 'a217832c-4522-4a9d-9599-62cc6013fed2'
of framework f6a4244b-b920-4ff5-94c9-2611a24dcbcf-0000 at executor(1)@10.3.1.5:52221
I0323 15:36:08.786633  2244 slave.cpp:919] Agent terminating
W0323 15:36:08.786633  2244 slave.cpp:3869] Ignoring shutdown framework f6a4244b-b920-4ff5-94c9-2611a24dcbcf-0000
because it is terminating
I0323 15:36:08.787554  7204 master.cpp:10545] Removing task a217832c-4522-4a9d-9599-62cc6013fed2
with resources cpus(allocated: *):4; mem(allocated: *):2048; disk(allocated: *):1024; ports(allocated:
*):[31000-32000] of framework f6a4244b-b920-4ff5-94c9-2611a24dcbcf-0000 on agent f6a4244b-b920-4ff5-94c9-2611a24dcbcf-S0
at slave(420)@10.3.1.5:52200 (winbldsrv-02.zq4gs31qjdiunm1ryi1452nvnh.dx.internal.cloudapp.net)
I0323 15:36:08.790546  7012 containerizer.cpp:2338] Destroying container 501c601e-f216-4ab3-b5a5-a6b6973d5fab
in RUNNING state
I0323 15:36:08.790546  7204 master.cpp:1295] Agent f6a4244b-b920-4ff5-94c9-2611a24dcbcf-S0
at slave(420)@10.3.1.5:52200 (winbldsrv-02.zq4gs31qjdiunm1ryi1452nvnh.dx.internal.cloudapp.net)
disconnected
I0323 15:36:08.790546  7012 containerizer.cpp:2952] Transitioning the state of container 501c601e-f216-4ab3-b5a5-a6b6973d5fab
from RUNNING to DESTROYING
I0323 15:36:08.790546  7204 master.cpp:3283] Disconnecting agent f6a4244b-b920-4ff5-94c9-2611a24dcbcf-S0
at slave(420)@10.3.1.5:52200 (winbldsrv-02.zq4gs31qjdiunm1ryi1452nvnh.dx.internal.cloudapp.net)
I0323 15:36:08.790546  7204 master.cpp:3302] Deactivating agent f6a4244b-b920-4ff5-94c9-2611a24dcbcf-S0
at slave(420)@10.3.1.5:52200 (winbldsrv-02.zq4gs31qjdiunm1ryi1452nvnh.dx.internal.cloudapp.net)
I0323 15:36:08.791564  6620 hierarchical.cpp:344] Removed framework f6a4244b-b920-4ff5-94c9-2611a24dcbcf-0000
I0323 15:36:08.791564  7012 launcher.cpp:156] Asked to destroy container 501c601e-f216-4ab3-b5a5-a6b6973d5fab
I0323 15:36:08.792559  6620 hierarchical.cpp:766] Agent f6a4244b-b920-4ff5-94c9-2611a24dcbcf-S0
deactivated
I0323 15:36:08.880559  7548 containerizer.cpp:2791] Container 501c601e-f216-4ab3-b5a5-a6b6973d5fab
has exited
I0323 15:36:08.910575  4316 master.cpp:1137] Master terminating
I0323 15:36:08.913564  4092 hierarchical.cpp:609] Removed agent f6a4244b-b920-4ff5-94c9-2611a24dcbcf-S0
I0323 15:36:09.389565  1816 process.cpp:929] Stopped the socket accept loop
```

- Mesos Reviewbot Windows


On March 23, 2018, 2:40 p.m., Benno Evers wrote:
> 
> -----------------------------------------------------------
> This is an automatically generated e-mail. To reply, visit:
> https://reviews.apache.org/r/66248/
> -----------------------------------------------------------
> 
> (Updated March 23, 2018, 2:40 p.m.)
> 
> 
> Review request for mesos and Alexander Rukletsov.
> 
> 
> Bugs: MESOS-8711
>     https://issues.apache.org/jira/browse/MESOS-8711
> 
> 
> Repository: mesos
> 
> 
> Description
> -------
> 
> This test was originally written with the assumption that the
> would give get a new agent id after receiving a Shutdown
> message from the master.
> 
> When that behaviour was changed, the test was disabled since it
> could not recover the previous agent id when a fault domain
> was added.
> 
> With the introduction of reconfiguration policies, this became
> possible, so the test can be re-enabled. Note that after adding
> the necessary modifications, the test becomes very similar but
> not completely identical to SlaveTest.ReconfigurationPolicy.
> 
> 
> Diffs
> -----
> 
>   src/tests/slave_tests.cpp 028cd32c7043eba4e6f2045956471bd0bf42371c 
> 
> 
> Diff: https://reviews.apache.org/r/66248/diff/1/
> 
> 
> Testing
> -------
> 
> 
> Thanks,
> 
> Benno Evers
> 
>


Mime
  • Unnamed multipart/alternative (inline, None, 0 bytes)
View raw message