mesos-reviews mailing list archives

Site index · List index
Message view « Date » · « Thread »
Top « Date » · « Thread »
From Mesos Reviewbot Windows <revi...@mesos.apache.org>
Subject Re: Review Request 66230: Added test for adding/removing framework roles.
Date Thu, 22 Mar 2018 22:54:47 GMT

-----------------------------------------------------------
This is an automatically generated e-mail. To reply, visit:
https://reviews.apache.org/r/66230/#review199816
-----------------------------------------------------------



FAIL: Some of the unit tests failed. Please check the relevant logs.

Reviews applied: `['66228', '66229', '66230']`

Failed command: `Start-MesosCITesting`

All the build artifacts available at: http://dcos-win.westus.cloudapp.azure.com/mesos-build/review/66230

Relevant logs:

- [mesos-tests-stdout.log](http://dcos-win.westus.cloudapp.azure.com/mesos-build/review/66230/logs/mesos-tests-stdout.log):

```
[       OK ] Endpoint/SlaveEndpointTest.NoAuthorizer/2 (112 ms)
[----------] 9 tests from Endpoint/SlaveEndpointTest (1052 ms total)

[----------] 2 tests from ContainerizerType/DefaultContainerDNSFlagTest
[ RUN      ] ContainerizerType/DefaultContainerDNSFlagTest.ValidateFlag/0
[       OK ] ContainerizerType/DefaultContainerDNSFlagTest.ValidateFlag/0 (33 ms)
[ RUN      ] ContainerizerType/DefaultContainerDNSFlagTest.ValidateFlag/1
[       OK ] ContainerizerType/DefaultContainerDNSFlagTest.ValidateFlag/1 (37 ms)
[----------] 2 tests from ContainerizerType/DefaultContainerDNSFlagTest (72 ms total)

[----------] 1 test from IsolationFlag/CpuIsolatorTest
[ RUN      ] IsolationFlag/CpuIsolatorTest.ROOT_UserCpuUsage/0
[       OK ] IsolationFlag/CpuIsolatorTest.ROOT_UserCpuUsage/0 (923 ms)
[----------] 1 test from IsolationFlag/CpuIsolatorTest (951 ms total)

[----------] 1 test from IsolationFlag/MemoryIsolatorTest
[ RUN      ] IsolationFlag/MemoryIsolatorTest.ROOT_MemUsage/0
[       OK ] IsolationFlag/MemoryIsolatorTest.ROOT_MemUsage/0 (827 ms)
[----------] 1 test from IsolationFlag/MemoryIsolatorTest (852 ms total)

[----------] Global test environment tear-down
[==========] 947 tests from 94 test cases ran. (453723 ms total)
[  PASSED  ] 946 tests.
[  FAILED  ] 1 test, listed below:
[  FAILED  ] CommandExecutorCheckTest.CommandCheckTimeout

 1 FAILED TEST
  YOU HAVE 215 DISABLED TESTS

```

- [mesos-tests-stderr.log](http://dcos-win.westus.cloudapp.azure.com/mesos-build/review/66230/logs/mesos-tests-stderr.log):

```
I0322 22:54:34.885884  9936 executor.cpp:176] Received SUBSCRIBED event
I0322 22:54:34.889904  9936 executor.cpp:180] Subscribed executor on winbldsrv-01.zq4gs31qjdiunm1ryi1452nvnh.dx.internal.cloudapp.net
I0322 22:54:34.889904  9936 executor.cpp:176] Received LAUNCH event
I0322 22:54:34.894891  9936 executor.cpp:648] Starting task 1af8334f-7b03-4825-b5b7-4d5d9412cadf
I0322 22:54:34.983899  9936 executor.cpp:483] Running 'D:\DCOS\mesos\src\mesos-containerizer.exe
launch <POSSIBLY-SENSITIVE-DATA>'
I0322 22:54:35.017901  9936 executor.cpp:661] Forked command at 1660
I0322 22:54:35.048874  4740 exec.cpp:445] Executor asked to shutdown
I0322 22:54:35.049862 10948 executor.cpp:176] Received SHUTDOWN event
I0322 22:54:35.049862 10948 executor.cpp:758] Shutting down
I0322 22:54:35.049862 10948 executor.cpp:868] Sending SIGTERM to process tree at pid 147f7ee77361b-0000
(default) at scheduler-375ed527-9959-4ae1-8855-e216b59fb12e@10.3.1.8:57353
I0322 22:54:35.046892  8936 hierarchical.cpp:405] Deactivated framework 8e78ed4c-ab68-4c23-8b91-47f7ee77361b-0000
I0322 22:54:35.046892  7044 master.cpp:10380] Updating the state of task 1af8334f-7b03-4825-b5b7-4d5d9412cadf
of framework 8e78ed4c-ab68-4c23-8b91-47f7ee77361b-0000 (latest state: TASK_KILLED, status
update state: TASK_KILLED)
I0322 22:54:35.046892  7968 slave.cpp:3873] Shutting down framework 8e78ed4c-ab68-4c23-8b91-47f7ee77361b-0000
I0322 22:54:35.046892  7968 slave.cpp:6566] Shutting down executor '1af8334f-7b03-4825-b5b7-4d5d9412cadf'
of framework 8e78ed4c-ab68-4c23-8b91-47f7ee77361b-0000 at executor(1)@10.3.1.8:57374
I0322 22:54:35.048874 11784 slave.cpp:919] Agent terminating
W0322 22:54:35.048874 11784 slave.cpp:3869] Ignoring shutdown framework 8e78ed4c-ab68-4c23-8b91-47f7ee77361b-0000
because it is terminating
I0322 22:54:35.049862  7044 master.cpp:10479] Removing task 1af8334f-7b03-4825-b5b7-4d5d9412cadf
with resources cpus(allocated: *):4; mem(allocated: *):2048; disk(allocated: *):1024; ports(allocated:
*):[31000-32000] of framework 8e78ed4c-ab68-4c23-8b91-47f7ee77361b-0000 on agent 8e78ed4c-ab68-4c23-8b91-47f7ee77361b-S0
at slave(416)@10.3.1.8:57353 (winbldsrv-01.zq4gs31qjdiunm1ryi1452nvnh.dx.internal.cloudapp.net)
I0322 22:54:35.054867  9020 containerizer.cpp:2338] Destroying container 51b28e28-4367-4d18-a081-b5ddcd848489
in RUNNING state
I0322 22:54:35.054867  9020 containerizer.cpp:2952] Transitioning the state of container 51b28e28-4367-4d18-a081-b5ddcd848489
from RUNNING to DESTROYING
I0322 22:54:35.055869  7044 master.cpp:1295] Agent 8e78ed4c-ab68-4c23-8b91-47f7ee77361b-S0
at slave(416)@10.3.1.8:57353 (winbldsrv-01.zq4gs31qjdiunm1ryi1452nvnh.dx.internal.cloudapp.net)
disconnected
I0322 22:54:35.055869  7044 master.cpp:3265] Disconnecting agent 8e78ed4c-ab68-4c23-8b91-47f7ee77361b-S0
at slave(416)@10.3.1.8:57353 (winbldsrv-01.zq4gs31qjdiunm1ryi1452nvnh.dx.internal.cloudapp.net)
I0322 22:54:35.055869  7044 master.cpp:3284] Deactivating agent 8e78ed4c-ab68-4c23-8b91-47f7ee77361b-S0
at slave(416)@10.3.1.8:57353 (winbldsrv-01.zq4gs31qjdiunm1ryi1452nvnh.dx.internal.cloudapp.net)
I0322 22:54:35.055869  9020 launcher.cpp:156] Asked to destroy container 51b28e28-4367-4d18-a081-b5ddcd848489
I0322 22:54:35.056887  5712 hierarchical.cpp:344] Removed framework 8e78ed4c-ab68-4c23-8b91-47f7ee77361b-0000
I0322 22:54:35.056887  5712 hierarchical.cpp:766] Agent 8e78ed4c-ab68-4c23-8b91-47f7ee77361b-S0
deactivated
I0322 22:54:35.096860  9912 containerizer.cpp:2791] Container 51b28e28-4367-4d18-a081-b5ddcd848489
has exited
I0322 22:54:35.127905 11784 master.cpp:1137] Master terminating
I0322 22:54:35.131037 11308 hierarchical.cpp:609] Removed agent 8e78ed4c-ab68-4c23-8b91-47f7ee77361b-S0
I0322 22:54:35.504889  8152 process.cpp:929] Stopped the socket accept loop
```

- Mesos Reviewbot Windows


On March 22, 2018, 8:53 p.m., Kapil Arya wrote:
> 
> -----------------------------------------------------------
> This is an automatically generated e-mail. To reply, visit:
> https://reviews.apache.org/r/66230/
> -----------------------------------------------------------
> 
> (Updated March 22, 2018, 8:53 p.m.)
> 
> 
> Review request for mesos, Benjamin Mahler and Till Toenshoff.
> 
> 
> Bugs: MESOS-7258
>     https://issues.apache.org/jira/browse/MESOS-7258
> 
> 
> Repository: mesos
> 
> 
> Description
> -------
> 
> Added test for adding/removing framework roles.
> 
> 
> Diffs
> -----
> 
>   src/tests/scheduler_tests.cpp 397a0908432ad50fa94fd939a604b096a06f8a1d 
> 
> 
> Diff: https://reviews.apache.org/r/66230/diff/3/
> 
> 
> Testing
> -------
> 
> 
> Thanks,
> 
> Kapil Arya
> 
>


Mime
  • Unnamed multipart/alternative (inline, None, 0 bytes)
View raw message