mesos-reviews mailing list archives

Site index · List index
Message view « Date » · « Thread »
Top « Date » · « Thread »
From Mesos Reviewbot Windows <revi...@mesos.apache.org>
Subject Re: Review Request 66220: Added test for `GROW_VOLUME` and `SHRINK_VOLUME` operations.
Date Thu, 22 Mar 2018 17:48:43 GMT

-----------------------------------------------------------
This is an automatically generated e-mail. To reply, visit:
https://reviews.apache.org/r/66220/#review199788
-----------------------------------------------------------



FAIL: Some of the unit tests failed. Please check the relevant logs.

Reviews applied: `['66049', '66050', '66052', '66051', '66218', '66219', '66220']`

Failed command: `Start-MesosCITesting`

All the build artifacts available at: http://dcos-win.westus.cloudapp.azure.com/mesos-build/review/66220

Relevant logs:

- [mesos-tests-stdout.log](http://dcos-win.westus.cloudapp.azure.com/mesos-build/review/66220/logs/mesos-tests-stdout.log):

```
[       OK ] Endpoint/SlaveEndpointTest.NoAuthorizer/2 (109 ms)
[----------] 9 tests from Endpoint/SlaveEndpointTest (1062 ms total)

[----------] 2 tests from ContainerizerType/DefaultContainerDNSFlagTest
[ RUN      ] ContainerizerType/DefaultContainerDNSFlagTest.ValidateFlag/0
[       OK ] ContainerizerType/DefaultContainerDNSFlagTest.ValidateFlag/0 (32 ms)
[ RUN      ] ContainerizerType/DefaultContainerDNSFlagTest.ValidateFlag/1
[       OK ] ContainerizerType/DefaultContainerDNSFlagTest.ValidateFlag/1 (37 ms)
[----------] 2 tests from ContainerizerType/DefaultContainerDNSFlagTest (72 ms total)

[----------] 1 test from IsolationFlag/CpuIsolatorTest
[ RUN      ] IsolationFlag/CpuIsolatorTest.ROOT_UserCpuUsage/0
[       OK ] IsolationFlag/CpuIsolatorTest.ROOT_UserCpuUsage/0 (809 ms)
[----------] 1 test from IsolationFlag/CpuIsolatorTest (833 ms total)

[----------] 1 test from IsolationFlag/MemoryIsolatorTest
[ RUN      ] IsolationFlag/MemoryIsolatorTest.ROOT_MemUsage/0
[       OK ] IsolationFlag/MemoryIsolatorTest.ROOT_MemUsage/0 (836 ms)
[----------] 1 test from IsolationFlag/MemoryIsolatorTest (864 ms total)

[----------] Global test environment tear-down
[==========] 943 tests from 94 test cases ran. (494702 ms total)
[  PASSED  ] 942 tests.
[  FAILED  ] 1 test, listed below:
[  FAILED  ] CommandExecutorCheckTest.CommandCheckTimeout

 1 FAILED TEST
  YOU HAVE 215 DISABLED TESTS

```

- [mesos-tests-stderr.log](http://dcos-win.westus.cloudapp.azure.com/mesos-build/review/66220/logs/mesos-tests-stderr.log):

```
I0322 17:48:28.511474  7556 master.cpp:10374] Updating the state of task 8cd82f36-e752-4b85-8825-9b9b5781d64c
of framework b9f57e0f-bc01-4782-af35-d9de66556fe9-0000 (latest state: TASK_KILLED, status
update state: TASK_KILLED)
I0322 17:48:28.511474  8468I0322 17:48:28.319489  2160 exec.cpp:162] Version: 1.6.0
I0322 17:48:28.346469  8900 exec.cpp:236] Executor registered on agent b9f57e0f-bc01-4782-af35-d9de66556fe9-S0
I0322 17:48:28.350457  7236 executor.cpp:176] Received SUBSCRIBED event
I0322 17:48:28.355482  7236 executor.cpp:180] Subscribed executor on winbldsrv-01.zq4gs31qjdiunm1ryi1452nvnh.dx.internal.cloudapp.net
I0322 17:48:28.356497  7236 executor.cpp:176] Received LAUNCH event
I0322 17:48:28.361474  7236 executor.cpp:648] Starting task 8cd82f36-e752-4b85-8825-9b9b5781d64c
I0322 17:48:28.451474  7236 executor.cpp:483] Running 'D:\DCOS\mesos\src\mesos-containerizer.exe
launch <POSSIBLY-SENSITIVE-DATA>'
I0322 17:48:28.486456  7236 executor.cpp:661] Forked command at 10628
I0322 17:48:28.514452  7796 exec.cpp:445] Executor asked to shutdown
I0322 17:48:28.515460  6880 executor.cpp:176] Received SHUTDOWN event
I0322 17:48:28.515460  6880 executor.cpp:758] Shutting down
I0322 17:48:28.515460  6880 executor.cpp:868] Sending SIGTERM to process tree at pid  slave.cpp:3873]
Shutting down framework b9f57e0f-bc01-4782-af35-d9de66556fe9-0000
I0322 17:48:28.512471  8468 slave.cpp:6617] Shutting down executor '8cd82f36-e752-4b85-8825-9b9b5781d64c'
of framework b9f57e0f-bc01-4782-af35-d9de66556fe9-0000 at executor(1)@10.3.1.8:52549
I0322 17:48:28.514452  8468 slave.cpp:919] Agent terminating
W0322 17:48:28.514452  8468 slave.cpp:3869] Ignoring shutdown framework b9f57e0f-bc01-4782-af35-d9de66556fe9-0000
because it is terminating
I0322 17:48:28.515460  7556 master.cpp:10473] Removing task 8cd82f36-e752-4b85-8825-9b9b5781d64c
with resources cpus(allocated: *):4; mem(allocated: *):2048; disk(allocated: *):1024; ports(allocated:
*):[31000-32000] of framework b9f57e0f-bc01-4782-af35-d9de66556fe9-0000 on agent b9f57e0f-bc01-4782-af35-d9de66556fe9-S0
at slave(412)@10.3.1.8:52528 (winbldsrv-01.zq4gs31qjdiunm1ryi1452nvnh.dx.internal.cloudapp.net)
I0322 17:48:28.517442  8468 containerizer.cpp:2338] Destroying container ffba61a9-0761-4f64-b03d-95468a286ebc
in RUNNING state
I0322 17:48:28.518457  8468 containerizer.cpp:2952] Transitioning the state of container ffba61a9-0761-4f64-b03d-95468a286ebc
from RUNNING to DESTROYING
I0322 17:48:28.518457  7556 master.cpp:1295] Agent b9f57e0f-bc01-4782-af35-d9de66556fe9-S0
at slave(412)@10.3.1.8:52528 (winbldsrv-01.zq4gs31qjdiunm1ryi1452nvnh.dx.internal.cloudapp.net)
disconnected
I0322 17:48:28.518457  7556 master.cpp:3283] Disconnecting agent b9f57e0f-bc01-4782-af35-d9de66556fe9-S0
at slave(412)@10.3.1.8:52528 (winbldsrv-01.zq4gs31qjdiunm1ryi1452nvnh.dx.internal.cloudapp.net)
I0322 17:48:28.519444  7556 master.cpp:3302] Deactivating agent b9f57e0f-bc01-4782-af35-d9de66556fe9-S0
at slave(412)@10.3.1.8:52528 (winbldsrv-01.zq4gs31qjdiunm1ryi1452nvnh.dx.internal.cloudapp.net)
I0322 17:48:28.519444  9148 hierarchical.cpp:344] Removed framework b9f57e0f-bc01-4782-af35-d9de66556fe9-0000
I0322 17:48:28.519444  8468 launcher.cpp:156] Asked to destroy container ffba61a9-0761-4f64-b03d-95468a286ebc
I0322 17:48:28.519444  9148 hierarchical.cpp:766] Agent b9f57e0f-bc01-4782-af35-d9de66556fe9-S0
deactivated
I0322 17:48:28.567540  2684 containerizer.cpp:2791] Container ffba61a9-0761-4f64-b03d-95468a286ebc
has exited
I0322 17:48:28.599535  2368 master.cpp:1137] Master terminating
I0322 17:48:28.601526  8880 hierarchical.cpp:609] Removed agent b9f57e0f-bc01-4782-af35-d9de66556fe9-S0
I0322 17:48:28.956545 10488 process.cpp:929] Stopped the socket accept loop
```

- Mesos Reviewbot Windows


On March 22, 2018, 9:30 a.m., Zhitao Li wrote:
> 
> -----------------------------------------------------------
> This is an automatically generated e-mail. To reply, visit:
> https://reviews.apache.org/r/66220/
> -----------------------------------------------------------
> 
> (Updated March 22, 2018, 9:30 a.m.)
> 
> 
> Review request for mesos, Chun-Hung Hsiao and Gaston Kleiman.
> 
> 
> Bugs: MESOS-4965
>     https://issues.apache.org/jira/browse/MESOS-4965
> 
> 
> Repository: mesos
> 
> 
> Description
> -------
> 
> Added test for `GROW_VOLUME` and `SHRINK_VOLUME` operations.
> 
> 
> Diffs
> -----
> 
>   src/tests/persistent_volume_tests.cpp 924d8458e54e34a49c99593482b5908c5f7c7a48 
> 
> 
> Diff: https://reviews.apache.org/r/66220/diff/1/
> 
> 
> Testing
> -------
> 
> 
> Thanks,
> 
> Zhitao Li
> 
>


Mime
  • Unnamed multipart/alternative (inline, None, 0 bytes)
View raw message