mesos-reviews mailing list archives

Site index · List index
Message view « Date » · « Thread »
Top « Date » · « Thread »
From Mesos Reviewbot Windows <revi...@mesos.apache.org>
Subject Re: Review Request 66212: Updated `ParseV1ImageManifest` to check `Volumes` and `ExposedPorts`.
Date Thu, 22 Mar 2018 11:40:57 GMT

-----------------------------------------------------------
This is an automatically generated e-mail. To reply, visit:
https://reviews.apache.org/r/66212/#review199753
-----------------------------------------------------------



FAIL: Some of the unit tests failed. Please check the relevant logs.

Reviews applied: `['66206', '66207', '66211', '66212']`

Failed command: `Start-MesosCITesting`

All the build artifacts available at: http://dcos-win.westus.cloudapp.azure.com/mesos-build/review/66212

Relevant logs:

- [mesos-tests-stdout.log](http://dcos-win.westus.cloudapp.azure.com/mesos-build/review/66212/logs/mesos-tests-stdout.log):

```
[       OK ] Endpoint/SlaveEndpointTest.NoAuthorizer/2 (114 ms)
[----------] 9 tests from Endpoint/SlaveEndpointTest (1025 ms total)

[----------] 2 tests from ContainerizerType/DefaultContainerDNSFlagTest
[ RUN      ] ContainerizerType/DefaultContainerDNSFlagTest.ValidateFlag/0
[       OK ] ContainerizerType/DefaultContainerDNSFlagTest.ValidateFlag/0 (35 ms)
[ RUN      ] ContainerizerType/DefaultContainerDNSFlagTest.ValidateFlag/1
[       OK ] ContainerizerType/DefaultContainerDNSFlagTest.ValidateFlag/1 (39 ms)
[----------] 2 tests from ContainerizerType/DefaultContainerDNSFlagTest (75 ms total)

[----------] 1 test from IsolationFlag/CpuIsolatorTest
[ RUN      ] IsolationFlag/CpuIsolatorTest.ROOT_UserCpuUsage/0
[       OK ] IsolationFlag/CpuIsolatorTest.ROOT_UserCpuUsage/0 (797 ms)
[----------] 1 test from IsolationFlag/CpuIsolatorTest (829 ms total)

[----------] 1 test from IsolationFlag/MemoryIsolatorTest
[ RUN      ] IsolationFlag/MemoryIsolatorTest.ROOT_MemUsage/0
[       OK ] IsolationFlag/MemoryIsolatorTest.ROOT_MemUsage/0 (842 ms)
[----------] 1 test from IsolationFlag/MemoryIsolatorTest (868 ms total)

[----------] Global test environment tear-down
[==========] 934 tests from 92 test cases ran. (672515 ms total)
[  PASSED  ] 933 tests.
[  FAILED  ] 1 test, listed below:
[  FAILED  ] DockerContainerizerHealthCheckTest.ROOT_DOCKER_DockerHealthyTaskWithQuotedCommand

 1 FAILED TEST
  YOU HAVE 215 DISABLED TESTS

```

- [mesos-tests-stderr.log](http://dcos-win.westus.cloudapp.azure.com/mesos-build/review/66212/logs/mesos-tests-stderr.log):

```
I0322 11:40:42.636289  3784 slave.cpp:3873] Shutting down framework 811ae62e-cb55-417c-95c9-cbad684097ac-0000
I0322 11:40:42.636289 15356 master.cpp:10248] Updating the state of task 2d951301-9f81-4ec9-821f-966f7954681e
of framework 811ae62e-cb55-417c-95c9-cbad684097ac-0000 (latest state: TASK_KILLED, status
update state: TASK_KILLED)
I0322 11:40:42.636289  3784 slave.cpp:6566] Shutting down executoI0322 11:40:42.447266 12384
exec.cpp:162] Version: 1.6.0
I0322 11:40:42.473261  5696 exec.cpp:236] Executor registered on agent 811ae62e-cb55-417c-95c9-cbad684097ac-S0
I0322 11:40:42.477268 15232 executor.cpp:176] Received SUBSCRIBED event
I0322 11:40:42.483260 15232 executor.cpp:180] Subscribed executor on win-bld-srv-01.zq4gs31qjdiunm1ryi1452nvnh.dx.internal.cloudapp.net
I0322 11:40:42.484269 15232 executor.cpp:176] Received LAUNCH event
I0322 11:40:42.489269 15232 executor.cpp:648] Starting task 2d951301-9f81-4ec9-821f-966f7954681e
I0322 11:40:42.572273 15232 executor.cpp:483] Running 'D:\DCOS\mesos\src\mesos-containerizer.exe
launch <POSSIBLY-SENSITIVE-DATA>'
I0322 11:40:42.602282 15232 executor.cpp:661] Forked command at 6616
I0322 11:40:42.638272 13168 exec.cpp:445] Executor asked to shutdown
I0322 11:40:42.639267 14728 executor.cpp:176] Received SHUTDOWN event
I0322 11:40:42.639267 14728 executor.cpp:758] Shutting down
I0322 11:40:42.639267 14728 executor.cpp:868] Sending SIGTERM to process tree at pidr '2d951301-9f81-4ec9-821f-966f7954681e'
of framework 811ae62e-cb55-417c-95c9-cbad684097ac-0000 at executor(1)@10.3.1.8:53206
I0322 11:40:42.638272  3784 slave.cpp:919] Agent terminating
W0322 11:40:42.638272  3784 slave.cpp:3869] Ignoring shutdown framework 811ae62e-cb55-417c-95c9-cbad684097ac-0000
because it is terminating
I0322 11:40:42.639267 15356 master.cpp:10347] Removing task 2d951301-9f81-4ec9-821f-966f7954681e
with resources cpus(allocated: *):4; mem(allocated: *):2048; disk(allocated: *):1024; ports(allocated:
*):[31000-32000] of framework 811ae62e-cb55-417c-95c9-cbad684097ac-0000 on agent 811ae62e-cb55-417c-95c9-cbad684097ac-S0
at slave(405)@10.3.1.8:51374 (win-bld-srv-01.zq4gs31qjdiunm1ryi1452nvnh.dx.internal.cloudapp.net)
I0322 11:40:42.641265  8976 containerizer.cpp:2338] Destroying container 3255bfa2-f012-459f-b61f-268fec135974
in RUNNING state
I0322 11:40:42.641265  8976 containerizer.cpp:2952] Transitioning the state of container 3255bfa2-f012-459f-b61f-268fec135974
from RUNNING to DESTROYING
I0322 11:40:42.642271 15356 master.cpp:1295] Agent 811ae62e-cb55-417c-95c9-cbad684097ac-S0
at slave(405)@10.3.1.8:51374 (win-bld-srv-01.zq4gs31qjdiunm1ryi1452nvnh.dx.internal.cloudapp.net)
disconnected
I0322 11:40:42.642271 15356 master.cpp:3276] Disconnecting agent 811ae62e-cb55-417c-95c9-cbad684097ac-S0
at slave(405)@10.3.1.8:51374 (win-bld-srv-01.zq4gs31qjdiunm1ryi1452nvnh.dx.internal.cloudapp.net)
I0322 11:40:42.642271  1528 hierarchical.cpp:344] Removed framework 811ae62e-cb55-417c-95c9-cbad684097ac-0000
I0322 11:40:42.642271 15356 master.cpp:3295] Deactivating agent 811ae62e-cb55-417c-95c9-cbad684097ac-S0
at slave(405)@10.3.1.8:51374 (win-bld-srv-01.zq4gs31qjdiunm1ryi1452nvnh.dx.internal.cloudapp.net)
I0322 11:40:42.643268 14512 hierarchical.cpp:766] Agent 811ae62e-cb55-417c-95c9-cbad684097ac-S0
deactivated
I0322 11:40:42.643268  8976 launcher.cpp:156] Asked to destroy container 3255bfa2-f012-459f-b61f-268fec135974
I0322 11:40:42.745290 14568 containerizer.cpp:2791] Container 3255bfa2-f012-459f-b61f-268fec135974
has exited
I0322 11:40:42.780735 10264 master.cpp:1137] Master terminating
I0322 11:40:42.783295 14512 hierarchical.cpp:609] Removed agent 811ae62e-cb55-417c-95c9-cbad684097ac-S0
I0322 11:40:43.553351 13388 process.cpp:929] Stopped the socket accept loop
```

- Mesos Reviewbot Windows


On March 22, 2018, 10:47 a.m., Qian Zhang wrote:
> 
> -----------------------------------------------------------
> This is an automatically generated e-mail. To reply, visit:
> https://reviews.apache.org/r/66212/
> -----------------------------------------------------------
> 
> (Updated March 22, 2018, 10:47 a.m.)
> 
> 
> Review request for mesos and Gilbert Song.
> 
> 
> Bugs: MESOS-8718
>     https://issues.apache.org/jira/browse/MESOS-8718
> 
> 
> Repository: mesos
> 
> 
> Description
> -------
> 
> Updated `ParseV1ImageManifest` to check `Volumes` and `ExposedPorts`.
> 
> 
> Diffs
> -----
> 
>   src/tests/containerizer/docker_spec_tests.cpp 5fde49a495c2a2fa880e7cb1bae2f636edecd480

> 
> 
> Diff: https://reviews.apache.org/r/66212/diff/1/
> 
> 
> Testing
> -------
> 
> sudo make check
> 
> 
> Thanks,
> 
> Qian Zhang
> 
>


Mime
  • Unnamed multipart/alternative (inline, None, 0 bytes)
View raw message