mesos-reviews mailing list archives

Site index · List index
Message view « Date » · « Thread »
Top « Date » · « Thread »
From Mesos Reviewbot Windows <revi...@mesos.apache.org>
Subject Re: Review Request 66178: Added a test to verify that task launch order is enforced.
Date Wed, 21 Mar 2018 23:46:46 GMT

-----------------------------------------------------------
This is an automatically generated e-mail. To reply, visit:
https://reviews.apache.org/r/66178/#review199726
-----------------------------------------------------------



FAIL: Some of the unit tests failed. Please check the relevant logs.

Reviews applied: `['66118', '66119', '66120', '65679', '66126', '66143', '66144', '66145',
'66178']`

Failed command: `Start-MesosCITesting`

All the build artifacts available at: http://dcos-win.westus.cloudapp.azure.com/mesos-build/review/66178

Relevant logs:

- [mesos-tests-stdout.log](http://dcos-win.westus.cloudapp.azure.com/mesos-build/review/66178/logs/mesos-tests-stdout.log):

```
[----------] 9 tests from Endpoint/SlaveEndpointTest (1042 ms total)

[----------] 2 tests from ContainerizerType/DefaultContainerDNSFlagTest
[ RUN      ] ContainerizerType/DefaultContainerDNSFlagTest.ValidateFlag/0
[       OK ] ContainerizerType/DefaultContainerDNSFlagTest.ValidateFlag/0 (37 ms)
[ RUN      ] ContainerizerType/DefaultContainerDNSFlagTest.ValidateFlag/1
[       OK ] ContainerizerType/DefaultContainerDNSFlagTest.ValidateFlag/1 (38 ms)
[----------] 2 tests from ContainerizerType/DefaultContainerDNSFlagTest (77 ms total)

[----------] 1 test from IsolationFlag/CpuIsolatorTest
[ RUN      ] IsolationFlag/CpuIsolatorTest.ROOT_UserCpuUsage/0
[       OK ] IsolationFlag/CpuIsolatorTest.ROOT_UserCpuUsage/0 (820 ms)
[----------] 1 test from IsolationFlag/CpuIsolatorTest (849 ms total)

[----------] 1 test from IsolationFlag/MemoryIsolatorTest
[ RUN      ] IsolationFlag/MemoryIsolatorTest.ROOT_MemUsage/0
[       OK ] IsolationFlag/MemoryIsolatorTest.ROOT_MemUsage/0 (837 ms)
[----------] 1 test from IsolationFlag/MemoryIsolatorTest (865 ms total)

[----------] Global test environment tear-down
[==========] 936 tests from 92 test cases ran. (913303 ms total)
[  PASSED  ] 934 tests.
[  FAILED  ] 2 tests, listed below:
[  FAILED  ] DockerContainerizerHealthCheckTest.ROOT_DOCKER_DockerHealthyTask
[  FAILED  ] DockerContainerizerHealthCheckTest.ROOT_DOCKER_DockerHealthyTaskWithQuotedCommand

 2 FAILED TESTS
  YOU HAVE 215 DISABLED TESTS

```

- [mesos-tests-stderr.log](http://dcos-win.westus.cloudapp.azure.com/mesos-build/review/66178/logs/mesos-tests-stderr.log):

```
I0321 23:46:32.039214  8476 master.cpp:10248] Updating the state of task 996b5a45-f274-4bd2-835a-89493867eede
of framework 6beea5d7-6262-4008-8a3c-439346362782-0000 (latest state: TASK_KILLED, status
update state: TASK_KILLED)
I0321 23:46:32.039214  7628 slave.cpp:3871] Shutting down framework 6beea5d7-6262-4008-8a3c-439346362782-0000
I0321 23:46:32.039214  7628 slave.cpp:6564] Shutting down executor '996b5a45-f274-4bd2-835a-89493867eede'
of framework 6beea5d7-6262-4008-8a3c-4393463627I0321 23:46:31.840212  3196 exec.cpp:162] Version:
1.6.0
I0321 23:46:31.869184  6760 exec.cpp:236] Executor registered on agent 6beea5d7-6262-4008-8a3c-439346362782-S0
I0321 23:46:31.873210  3108 executor.cpp:176] Received SUBSCRIBED event
I0321 23:46:31.878209  3108 executor.cpp:180] Subscribed executor on win-bld-srv-01.zq4gs31qjdiunm1ryi1452nvnh.dx.internal.cloudapp.net
I0321 23:46:31.878209  3108 executor.cpp:176] Received LAUNCH event
I0321 23:46:31.883210  3108 executor.cpp:648] Starting task 996b5a45-f274-4bd2-835a-89493867eede
I0321 23:46:31.976214  3108 executor.cpp:483] Running 'D:\DCOS\mesos\src\mesos-containerizer.exe
launch <POSSIBLY-SENSITIVE-DATA>'
I0321 23:46:32.006216  3108 executor.cpp:661] Forked command at 14080
I0321 23:46:32.042184 12368 exec.cpp:445] Executor asked to shutdown
I0321 23:46:32.042184 14744 executor.cpp:176] Received SHUTDOWN event
I0321 23:46:32.042184 14744 executor.cpp:758] Shutting down
I0321 23:46:32.042184 14744 executor.cpp:868] Sending SIGTERM to process tree at pi82-0000
at executor(1)@10.3.1.8:63066
I0321 23:46:32.041184  7628 slave.cpp:919] Agent terminating
W0321 23:46:32.041184  7628 slave.cpp:3867] Ignoring shutdown framework 6beea5d7-6262-4008-8a3c-439346362782-0000
because it is terminating
I0321 23:46:32.041184  8476 master.cpp:10347] Removing task 996b5a45-f274-4bd2-835a-89493867eede
with resources cpus(allocated: *):4; mem(allocated: *):2048; disk(allocated: *):1024; ports(allocated:
*):[31000-32000] of framework 6beea5d7-6262-4008-8a3c-439346362782-0000 on agent 6beea5d7-6262-4008-8a3c-439346362782-S0
at slave(407)@10.3.1.8:61203 (win-bld-srv-01.zq4gs31qjdiunm1ryi1452nvnh.dx.internal.cloudapp.net)
I0321 23:46:32.044185  8476 master.cpp:1295] Agent 6beea5d7-6262-4008-8a3c-439346362782-S0
at slave(407)@10.3.1.8:61203 (win-bld-srv-01.zq4gs31qjdiunm1ryi1452nvnh.dx.internal.cloudapp.net)
disconnected
I0321 23:46:32.044185  8476 master.cpp:3276] Disconnecting agent 6beea5d7-6262-4008-8a3c-439346362782-S0
at slave(407)@10.3.1.8:61203 (win-bld-srv-01.zq4gs31qjdiunm1ryi1452nvnh.dx.internal.cloudapp.net)
I0321 23:46:32.044185  2228 hierarchical.cpp:344] Removed framework 6beea5d7-6262-4008-8a3c-439346362782-0000
I0321 23:46:32.044185  8476 master.cpp:3295] Deactivating agent 6beea5d7-6262-4008-8a3c-439346362782-S0
at slave(407)@10.3.1.8:61203 (win-bld-srv-01.zq4gs31qjdiunm1ryi1452nvnh.dx.internal.cloudapp.net)
I0321 23:46:32.045182 10244 containerizer.cpp:2338] Destroying container 6f725142-b559-44e2-89cb-25ed9bd92570
in RUNNING state
I0321 23:46:32.045182 10244 containerizer.cpp:2952] Transitioning the state of container 6f725142-b559-44e2-89cb-25ed9bd92570
from RUNNING to DESTROYING
I0321 23:46:32.045182  7628 hierarchical.cpp:766] Agent 6beea5d7-6262-4008-8a3c-439346362782-S0
deactivated
I0321 23:46:32.047181 10244 launcher.cpp:156] Asked to destroy container 6f725142-b559-44e2-89cb-25ed9bd92570
I0321 23:46:32.141197 14676 containerizer.cpp:2791] Container 6f725142-b559-44e2-89cb-25ed9bd92570
has exited
I0321 23:46:32.173188 11080 master.cpp:1137] Master terminating
I0321 23:46:32.175199  2228 hierarchical.cpp:609] Removed agent 6beea5d7-6262-4008-8a3c-439346362782-S0
I0321 23:46:32.753221 12712 process.cpp:929] Stopped the socket accept loop
```

- Mesos Reviewbot Windows


On March 21, 2018, 2:58 p.m., Meng Zhu wrote:
> 
> -----------------------------------------------------------
> This is an automatically generated e-mail. To reply, visit:
> https://reviews.apache.org/r/66178/
> -----------------------------------------------------------
> 
> (Updated March 21, 2018, 2:58 p.m.)
> 
> 
> Review request for mesos, Chun-Hung Hsiao and Greg Mann.
> 
> 
> Bugs: MESOS-8617 and MESOS-8624
>     https://issues.apache.org/jira/browse/MESOS-8617
>     https://issues.apache.org/jira/browse/MESOS-8624
> 
> 
> Repository: mesos
> 
> 
> Description
> -------
> 
> Agent should launch the task in their receiving order.
> On the task launch path, there are currently two
> asynchronous steps which may complete out of order:
> unschedule GC and task authorization.
> 
> This test simulates the reordering of the completions
> of task authorization step and verify that, despite the
> reordering, tasks can still launch in their original order.
> 
> 
> Diffs
> -----
> 
>   src/tests/mesos.hpp 2c3d0c9350bbbbcd2223ff20c0797d1849d38c19 
>   src/tests/mesos.cpp d82963195573dd9ed7d12a7708f64a236b28cdf1 
>   src/tests/slave_tests.cpp f76500ebdb67f131a57a3b5aaae8c952d019e354 
> 
> 
> Diff: https://reviews.apache.org/r/66178/diff/2/
> 
> 
> Testing
> -------
> 
> make check
> 
> 
> Thanks,
> 
> Meng Zhu
> 
>


Mime
  • Unnamed multipart/alternative (inline, None, 0 bytes)
View raw message