mesos-reviews mailing list archives

Site index · List index
Message view « Date » · « Thread »
Top « Date » · « Thread »
From Mesos Reviewbot Windows <revi...@mesos.apache.org>
Subject Re: Review Request 65987: Allow nested containers in pods to have separate namespaces(Ref: MESOS-8534).
Date Thu, 15 Mar 2018 05:01:37 GMT

-----------------------------------------------------------
This is an automatically generated e-mail. To reply, visit:
https://reviews.apache.org/r/65987/#review199245
-----------------------------------------------------------



FAIL: Some of the unit tests failed. Please check the relevant logs.

Reviews applied: `['65987']`

Failed command: `Start-MesosCITesting`

All the build artifacts available at: http://dcos-win.westus.cloudapp.azure.com/mesos-build/review/65987

Relevant logs:

- [libprocess-tests-stdout.log](http://dcos-win.westus.cloudapp.azure.com/mesos-build/review/65987/logs/libprocess-tests-stdout.log):

```
[ RUN      ] TimeTest.Output
[       OK ] TimeTest.Output (0 ms)
[----------] 4 tests from TimeTest (7 ms total)

[----------] 3 tests from TimeSeriesTest
[ RUN      ] TimeSeriesTest.Set
[       OK ] TimeSeriesTest.Set (0 ms)
[ RUN      ] TimeSeriesTest.Sparsify
[       OK ] TimeSeriesTest.Sparsify (1 ms)
[ RUN      ] TimeSeriesTest.Truncate
[       OK ] TimeSeriesTest.Truncate (1 ms)
[----------] 3 tests from TimeSeriesTest (8 ms total)

[----------] 3 tests from JWTTest
[ RUN      ] JWTTest.Parse
[       OK ] JWTTest.Parse (8 ms)
[ RUN      ] JWTTest.Create
[       OK ] JWTTest.Create (1 ms)
[ RUN      ] JWTTest.Stringify
[       OK ] JWTTest.Stringify (1 ms)
[----------] 3 tests from JWTTest (14 ms total)

[----------] 1 test from SSL
[ RUN      ] SSL.Disabled
[       OK ] SSL.Disabled (10 ms)
[----------] 1 test from SSL (11 ms total)

[----------] 17 tests from SSLTest
[ RUN      ] SSLTest.SSLSocket
```

- [libprocess-tests-stderr.log](http://dcos-win.westus.cloudapp.azure.com/mesos-build/review/65987/logs/libprocess-tests-stderr.log):

```
ABORT: (D:\DCOS\mesos\mesos\3rdparty\libprocess\include\process/ssl/gtest.hpp:171): Could
not generate certificate: Failed to set common name: X509_NAME_add_entry_by_txt
```

- [mesos-tests-cmake-stdout.log](http://dcos-win.westus.cloudapp.azure.com/mesos-build/review/65987/logs/mesos-tests-cmake-stdout.log):

```
         D:\DCOS\mesos\mesos\src\java\jni\convert.cpp(415): warning C4267: 'argument': conversion
from 'size_t' to 'jsize', possible loss of data [D:\DCOS\mesos\src\java\mesos-java.vcxproj]
         D:\DCOS\mesos\mesos\src\java\jni\convert.cpp(437): warning C4267: 'argument': conversion
from 'size_t' to 'jsize', possible loss of data [D:\DCOS\mesos\src\java\mesos-java.vcxproj]
         D:\DCOS\mesos\mesos\src\java\jni\convert.cpp(438): warning C4267: 'argument': conversion
from 'size_t' to 'jsize', possible loss of data [D:\DCOS\mesos\src\java\mesos-java.vcxproj]
         D:\DCOS\mesos\mesos\src\java\jni\convert.cpp(460): warning C4267: 'argument': conversion
from 'size_t' to 'jsize', possible loss of data [D:\DCOS\mesos\src\java\mesos-java.vcxproj]
         D:\DCOS\mesos\mesos\src\java\jni\convert.cpp(461): warning C4267: 'argument': conversion
from 'size_t' to 'jsize', possible loss of data [D:\DCOS\mesos\src\java\mesos-java.vcxproj]
         D:\DCOS\mesos\mesos\src\java\jni\convert.cpp(500): warning C4267: 'argument': conversion
from 'size_t' to 'jsize', possible loss of data [D:\DCOS\mesos\src\java\mesos-java.vcxproj]
         D:\DCOS\mesos\mesos\src\java\jni\convert.cpp(501): warning C4267: 'argument': conversion
from 'size_t' to 'jsize', possible loss of data [D:\DCOS\mesos\src\java\mesos-java.vcxproj]


       "D:\DCOS\mesos\src\tests\mesos-tests.vcxproj" (default target) (1) ->
       "D:\DCOS\mesos\src\mesos.vcxproj" (default target) (25) ->
       (ClCompile target) -> 
         D:\DCOS\mesos\mesos\src\master\validation.cpp(1508): error C2001: newline in constant
[D:\DCOS\mesos\src\mesos.vcxproj]
         D:\DCOS\mesos\mesos\src\master\validation.cpp(1509): error C2146: syntax error: missing
')' before identifier 'containers' [D:\DCOS\mesos\src\mesos.vcxproj]
         D:\DCOS\mesos\mesos\src\master\validation.cpp(1509): error C2146: syntax error: missing
';' before identifier 'containers' [D:\DCOS\mesos\src\mesos.vcxproj]
         D:\DCOS\mesos\mesos\src\master\validation.cpp(1509): error C2065: 'containers': undeclared
identifier [D:\DCOS\mesos\src\mesos.vcxproj]
         D:\DCOS\mesos\mesos\src\master\validation.cpp(1509): error C2143: syntax error: missing
';' before '!' [D:\DCOS\mesos\src\mesos.vcxproj]
         D:\DCOS\mesos\mesos\src\master\validation.cpp(1509): error C2065: 'joining': undeclared
identifier [D:\DCOS\mesos\src\mesos.vcxproj]
         D:\DCOS\mesos\mesos\src\master\validation.cpp(1509): error C2001: newline in constant
[D:\DCOS\mesos\src\mesos.vcxproj]
         D:\DCOS\mesos\mesos\src\master\validation.cpp(1509): error C2015: too many characters
in constant [D:\DCOS\mesos\src\mesos.vcxproj]
         D:\DCOS\mesos\mesos\src\master\validation.cpp(1509): error C2146: syntax error: missing
';' before identifier 'parent' [D:\DCOS\mesos\src\mesos.vcxproj]
         D:\DCOS\mesos\mesos\src\master\validation.cpp(1509): error C2065: 'parent': undeclared
identifier [D:\DCOS\mesos\src\mesos.vcxproj]
         D:\DCOS\mesos\mesos\src\master\validation.cpp(1509): error C2143: syntax error: missing
';' before 'constant' [D:\DCOS\mesos\src\mesos.vcxproj]
         D:\DCOS\mesos\mesos\src\master\validation.cpp(1510): error C2143: syntax error: missing
';' before '}' [D:\DCOS\mesos\src\mesos.vcxproj]

    214 Warning(s)
    12 Error(s)

Time Elapsed 00:17:31.70
```

- Mesos Reviewbot Windows


On March 15, 2018, 4:30 a.m., Sagar Patwardhan wrote:
> 
> -----------------------------------------------------------
> This is an automatically generated e-mail. To reply, visit:
> https://reviews.apache.org/r/65987/
> -----------------------------------------------------------
> 
> (Updated March 15, 2018, 4:30 a.m.)
> 
> 
> Review request for mesos and Jie Yu.
> 
> 
> Bugs: MESOS-8534
>     https://issues.apache.org/jira/browse/MESOS-8534
> 
> 
> Repository: mesos
> 
> 
> Description
> -------
> 
> Continued from https://github.com/apache/mesos/pull/263
> 
> 
> Diffs
> -----
> 
>   src/master/validation.cpp f0b86775b 
>   src/slave/containerizer/mesos/isolators/network/cni/cni.hpp 1d01915c2 
>   src/slave/containerizer/mesos/isolators/network/cni/cni.cpp 896656987 
> 
> 
> Diff: https://reviews.apache.org/r/65987/diff/5/
> 
> 
> Testing
> -------
> 
> Manually tested.
> 
> Working on unit tests.
> 
> 
> Thanks,
> 
> Sagar Patwardhan
> 
>


Mime
  • Unnamed multipart/alternative (inline, None, 0 bytes)
View raw message