mesos-reviews mailing list archives

Site index · List index
Message view « Date » · « Thread »
Top « Date » · « Thread »
From Mesos Reviewbot Windows <revi...@mesos.apache.org>
Subject Re: Review Request 66051: Implemented operator API to grow and shrink persistent volume.
Date Wed, 14 Mar 2018 03:26:42 GMT

-----------------------------------------------------------
This is an automatically generated e-mail. To reply, visit:
https://reviews.apache.org/r/66051/#review199149
-----------------------------------------------------------



FAIL: Some of the unit tests failed. Please check the relevant logs.

Reviews applied: `['66049', '66050', '66052', '66051']`

Failed command: `Start-MesosCITesting`

All the build artifacts available at: http://dcos-win.westus.cloudapp.azure.com/mesos-build/review/66051

Relevant logs:

- [mesos-tests-stdout.log](http://dcos-win.westus.cloudapp.azure.com/mesos-build/review/66051/logs/mesos-tests-stdout.log):

```
[----------] 9 tests from Endpoint/SlaveEndpointTest (1178 ms total)

[----------] 2 tests from ContainerizerType/DefaultContainerDNSFlagTest
[ RUN      ] ContainerizerType/DefaultContainerDNSFlagTest.ValidateFlag/0
[       OK ] ContainerizerType/DefaultContainerDNSFlagTest.ValidateFlag/0 (39 ms)
[ RUN      ] ContainerizerType/DefaultContainerDNSFlagTest.ValidateFlag/1
[       OK ] ContainerizerType/DefaultContainerDNSFlagTest.ValidateFlag/1 (44 ms)
[----------] 2 tests from ContainerizerType/DefaultContainerDNSFlagTest (85 ms total)

[----------] 1 test from IsolationFlag/CpuIsolatorTest
[ RUN      ] IsolationFlag/CpuIsolatorTest.ROOT_UserCpuUsage/0
[       OK ] IsolationFlag/CpuIsolatorTest.ROOT_UserCpuUsage/0 (2527 ms)
[----------] 1 test from IsolationFlag/CpuIsolatorTest (2552 ms total)

[----------] 1 test from IsolationFlag/MemoryIsolatorTest
[ RUN      ] IsolationFlag/MemoryIsolatorTest.ROOT_MemUsage/0
[       OK ] IsolationFlag/MemoryIsolatorTest.ROOT_MemUsage/0 (2593 ms)
[----------] 1 test from IsolationFlag/MemoryIsolatorTest (2618 ms total)

[----------] Global test environment tear-down
[==========] 916 tests from 91 test cases ran. (479165 ms total)
[  PASSED  ] 914 tests.
[  FAILED  ] 2 tests, listed below:
[  FAILED  ] CommandExecutorCheckTest.CommandCheckTimeout
[  FAILED  ] SlaveTest.RestartSlaveRequireExecutorAuthentication

 2 FAILED TESTS
  YOU HAVE 210 DISABLED TESTS

```

- [mesos-tests-stderr.log](http://dcos-win.westus.cloudapp.azure.com/mesos-build/review/66051/logs/mesos-tests-stderr.log):

```
I0314 03:26:29.838824  8100 master.cpp:10380] Updating the state of task b83253aa-a02f-4b84-9b7a-172cf8cef559
of framework f033d295-0a24-4df2-ba84-a6caf5e462b1-0000 (latest state: TASK_KILLED, status
update state: TASK_KILLED)
I0314 03:26:29.838824  9448 slave.cpp:3878] Shutting down framework f033d295-0a24-4df2-ba84-a6caf5e462b1I0314
03:26:29.110826  7716 exec.cpp:162] Version: 1.6.0
I0314 03:26:29.140822  7680 exec.cpp:236] Executor registered on agent f033d295-0a24-4df2-ba84-a6caf5e462b1-S0
I0314 03:26:29.144822 10668 executor.cpp:176] Received SUBSCRIBED event
I0314 03:26:29.150826 10668 executor.cpp:180] Subscribed executor on build-srv-03.zq4gs31qjdiunm1ryi1452nvnh.dx.internal.cloudapp.net
I0314 03:26:29.150826 10668 executor.cpp:176] Received LAUNCH event
I0314 03:26:29.155833 10668 executor.cpp:648] Starting task b83253aa-a02f-4b84-9b7a-172cf8cef559
I0314 03:26:29.239827 10668 executor.cpp:483] Running 'D:\DCOS\mesos\src\mesos-containerizer.exe
launch <POSSIBLY-SENSITIVE-DATA>'
I0314 03:26:29.801826 10668 executor.cpp:661] Forked command at 9432
I0314 03:26:29.842823  5456 exec.cpp:445] Executor asked to shutdown
I0314 03:26:29.843825 10668 executor.cpp:176] Received SHUTDOWN event
I0314 03:26:29.843825 10668 executor.cpp:758] Shutting down
I0314 03:26:29.844822 10668 executor.cpp:868] Sending SIGTERM to process tree at pid 9-0000
I0314 03:26:29.839823  9448 slave.cpp:6571] Shutting down executor 'b83253aa-a02f-4b84-9b7a-172cf8cef559'
of framework f033d295-0a24-4df2-ba84-a6caf5e462b1-0000 at executor(1)@10.3.1.11:65161
I0314 03:26:29.841823  9448 slave.cpp:924] Agent terminating
I0314 03:26:29.841823  8100 master.cpp:10479] Removing task b83253aa-a02f-4b84-9b7a-172cf8cef559
with resources cpus(allocated: *):4; mem(allocated: *):2048; disk(allocated: *):1024; ports(allocated:
*):[31000-32000] of framework f033d295-0a24-4df2-ba84-a6caf5e462b1-0000 on agent f033d295-0a24-4df2-ba84-a6caf5e462b1-S0
at slave(398)@10.3.1.11:65140 (build-srv-03.zq4gs31qjdiunm1ryi1452nvnh.dx.internal.cloudapp.net)
W0314 03:26:29.841823  9448 slave.cpp:3874] Ignoring shutdown framework f033d295-0a24-4df2-ba84-a6caf5e462b1-0000
because it is terminating
I0314 03:26:29.844822  8100 master.cpp:1288] Agent f033d295-0a24-4df2-ba84-a6caf5e462b1-S0
at slave(398)@10.3.1.11:65140 (build-srv-03.zq4gs31qjdiunm1ryi1452nvnh.dx.internal.cloudapp.net)
disconnected
I0314 03:26:29.844822  8100 master.cpp:3258] Disconnecting agent f033d295-0a24-4df2-ba84-a6caf5e462b1-S0
at slave(398)@10.3.1.11:65140 (build-srv-03.zq4gs31qjdiunm1ryi1452nvnh.dx.internal.cloudapp.net)
I0314 03:26:29.845823  3464 hierarchical.cpp:344] Removed framework f033d295-0a24-4df2-ba84-a6caf5e462b1-0000
I0314 03:26:29.845823  7644 containerizer.cpp:2338] Destroying container e7c5bd6e-37c7-46c1-a7e4-b19ccd0156fd
in RUNNING state
I0314 03:26:29.845823  7644 containerizer.cpp:2952] Transitioning the state of container e7c5bd6e-37c7-46c1-a7e4-b19ccd0156fd
from RUNNING to DESTROYING
I0314 03:26:29.845823  8100 master.cpp:3277] Deactivating agent f033d295-0a24-4df2-ba84-a6caf5e462b1-S0
at slave(398)@10.3.1.11:65140 (build-srv-03.zq4gs31qjdiunm1ryi1452nvnh.dx.internal.cloudapp.net)
I0314 03:26:29.846824  7408 hierarchical.cpp:766] Agent f033d295-0a24-4df2-ba84-a6caf5e462b1-S0
deactivated
I0314 03:26:29.846824  7644 launcher.cpp:156] Asked to destroy container e7c5bd6e-37c7-46c1-a7e4-b19ccd0156fd
I0314 03:26:29.954319  7408 containerizer.cpp:2791] Container e7c5bd6e-37c7-46c1-a7e4-b19ccd0156fd
has exited
I0314 03:26:29.987341  7736 master.cpp:1131] Master terminating
I0314 03:26:29.989344  8100 hierarchical.cpp:609] Removed agent f033d295-0a24-4df2-ba84-a6caf5e462b1-S0
I0314 03:26:30.524348  3040 process.cpp:929] Stopped the socket accept loop
```

- Mesos Reviewbot Windows


On March 13, 2018, 10:54 p.m., Zhitao Li wrote:
> 
> -----------------------------------------------------------
> This is an automatically generated e-mail. To reply, visit:
> https://reviews.apache.org/r/66051/
> -----------------------------------------------------------
> 
> (Updated March 13, 2018, 10:54 p.m.)
> 
> 
> Review request for mesos, Chun-Hung Hsiao and Gaston Kleiman.
> 
> 
> Bugs: MESOS-4965
>     https://issues.apache.org/jira/browse/MESOS-4965
> 
> 
> Repository: mesos
> 
> 
> Description
> -------
> 
> Implemented operator API to grow and shrink persistent volume.
> 
> 
> Diffs
> -----
> 
>   src/master/http.cpp cf03d8bf7df583c849a3b2a326d3772820181b0f 
>   src/master/master.hpp 8bf2c763dafdb7df55c46a56f2ff66f2a951d947 
>   src/master/validation.cpp 9254cd22e67d9aca53135701575fb0857ff6f7d6 
> 
> 
> Diff: https://reviews.apache.org/r/66051/diff/2/
> 
> 
> Testing
> -------
> 
> 
> Thanks,
> 
> Zhitao Li
> 
>


Mime
  • Unnamed multipart/alternative (inline, None, 0 bytes)
View raw message