mesos-reviews mailing list archives

Site index · List index
Message view « Date » · « Thread »
Top « Date » · « Thread »
From Mesos Reviewbot Windows <revi...@mesos.apache.org>
Subject Re: Review Request 65994: Made the master forward operation status updates to the schedulers.
Date Fri, 09 Mar 2018 01:03:37 GMT

-----------------------------------------------------------
This is an automatically generated e-mail. To reply, visit:
https://reviews.apache.org/r/65994/#review198920
-----------------------------------------------------------



FAIL: Some of the unit tests failed. Please check the relevant logs.

Reviews applied: `['65993', '65994']`

Failed command: `Start-MesosCITesting`

All the build artifacts available at: http://dcos-win.westus.cloudapp.azure.com/mesos-build/review/65994

Relevant logs:

- [mesos-tests-stdout.log](http://dcos-win.westus.cloudapp.azure.com/mesos-build/review/65994/logs/mesos-tests-stdout.log):

```
[       OK ] Endpoint/SlaveEndpointTest.NoAuthorizer/2 (126 ms)
[----------] 9 tests from Endpoint/SlaveEndpointTest (1231 ms total)

[----------] 2 tests from ContainerizerType/DefaultContainerDNSFlagTest
[ RUN      ] ContainerizerType/DefaultContainerDNSFlagTest.ValidateFlag/0
[       OK ] ContainerizerType/DefaultContainerDNSFlagTest.ValidateFlag/0 (38 ms)
[ RUN      ] ContainerizerType/DefaultContainerDNSFlagTest.ValidateFlag/1
[       OK ] ContainerizerType/DefaultContainerDNSFlagTest.ValidateFlag/1 (43 ms)
[----------] 2 tests from ContainerizerType/DefaultContainerDNSFlagTest (84 ms total)

[----------] 1 test from IsolationFlag/CpuIsolatorTest
[ RUN      ] IsolationFlag/CpuIsolatorTest.ROOT_UserCpuUsage/0
[       OK ] IsolationFlag/CpuIsolatorTest.ROOT_UserCpuUsage/0 (2508 ms)
[----------] 1 test from IsolationFlag/CpuIsolatorTest (2546 ms total)

[----------] 1 test from IsolationFlag/MemoryIsolatorTest
[ RUN      ] IsolationFlag/MemoryIsolatorTest.ROOT_MemUsage/0
[       OK ] IsolationFlag/MemoryIsolatorTest.ROOT_MemUsage/0 (2563 ms)
[----------] 1 test from IsolationFlag/MemoryIsolatorTest (2593 ms total)

[----------] Global test environment tear-down
[==========] 916 tests from 91 test cases ran. (475691 ms total)
[  PASSED  ] 915 tests.
[  FAILED  ] 1 test, listed below:
[  FAILED  ] CommandExecutorCheckTest.CommandCheckTimeout

 1 FAILED TEST
  YOU HAVE 210 DISABLED TESTS

```

- [mesos-tests-stderr.log](http://dcos-win.westus.cloudapp.azure.com/mesos-build/review/65994/logs/mesos-tests-stderr.log):

```
I0309 01:03:22.472306 11064 slave.cpp:3878] Shutting down framework c9377c2c-5b6d-422f-9a65-7b6034ffdc3d-0000
I0309 01:03:22.472306   412 master.cpp:10207] Updating the state of task 740893dd-e792-499d-9087-e629c409f9cc
of framework c9377c2c-5b6d-422f-9a65-7b6034ffdc3d-0000 (latest state: TASK_KILLED, status
update state: TASK_KILLED)
I0309 01:03:I0309 01:03:21.768302 11260 exec.cpp:162] Version: 1.6.0
I0309 01:03:21.797304 10412 exec.cpp:236] Executor registered on agent c9377c2c-5b6d-422f-9a65-7b6034ffdc3d-S0
I0309 01:03:21.801306  6440 executor.cpp:176] Received SUBSCRIBED event
I0309 01:03:21.806329  6440 executor.cpp:180] Subscribed executor on build-srv-03.zq4gs31qjdiunm1ryi1452nvnh.dx.internal.cloudapp.net
I0309 01:03:21.807332  6440 executor.cpp:176] Received LAUNCH event
I0309 01:03:21.812330  6440 executor.cpp:648] Starting task 740893dd-e792-499d-9087-e629c409f9cc
I0309 01:03:21.895328  6440 executor.cpp:483] Running 'D:\DCOS\mesos\src\mesos-containerizer.exe
launch <POSSIBLY-SENSITIVE-DATA>'
I0309 01:03:22.436327  6440 executor.cpp:661] Forked command at 7124
I0309 01:03:22.476306  7824 exec.cpp:445] Executor asked to shutdown
I0309 01:03:22.477304  6440 executor.cpp:176] Received SHUTDOWN event
I0309 01:03:22.477304  6440 executor.cpp:758] Shutting down
I0309 01:03:22.477304  6440 executor.cpp:868] Sending SIGTERM to process tree at pid 722.472306
11064 slave.cpp:6571] Shutting down executor '740893dd-e792-499d-9087-e629c409f9cc' of framework
c9377c2c-5b6d-422f-9a65-7b6034ffdc3d-0000 at executor(1)@10.3.1.11:56245
I0309 01:03:22.474305 11064 slave.cpp:924] Agent terminating
W0309 01:03:22.474305 11064 slave.cpp:3874] Ignoring shutdown framework c9377c2c-5b6d-422f-9a65-7b6034ffdc3d-0000
because it is terminating
I0309 01:03:22.474305   412 master.cpp:10306] Removing task 740893dd-e792-499d-9087-e629c409f9cc
with resources cpus(allocated: *):4; mem(allocated: *):2048; disk(allocated: *):1024; ports(allocated:
*):[31000-32000] of framework c9377c2c-5b6d-422f-9a65-7b6034ffdc3d-0000 on agent c9377c2c-5b6d-422f-9a65-7b6034ffdc3d-S0
at slave(398)@10.3.1.11:56224 (build-srv-03.zq4gs31qjdiunm1ryi1452nvnh.dx.internal.cloudapp.net)
I0309 01:03:22.477304   412 master.cpp:1306] Agent c9377c2c-5b6d-422f-9a65-7b6034ffdc3d-S0
at slave(398)@10.3.1.11:56224 (build-srv-03.zq4gs31qjdiunm1ryi1452nvnh.dx.internal.cloudapp.net)
disconnected
I0309 01:03:22.478305   412 master.cpp:3276] Disconnecting agent c9377c2c-5b6d-422f-9a65-7b6034ffdc3d-S0
at slave(398)@10.3.1.11:56224 (build-srv-03.zq4gs31qjdiunm1ryi1452nvnh.dx.internal.cloudapp.net)
I0309 01:03:22.478305 10192 hierarchical.cpp:344] Removed framework c9377c2c-5b6d-422f-9a65-7b6034ffdc3d-0000
I0309 01:03:22.478305  4572 containerizer.cpp:2338] Destroying container 6d5838d9-e5fa-4ea3-ac28-db47c7e40a74
in RUNNING state
I0309 01:03:22.479305  4572 containerizer.cpp:2952] Transitioning the state of container 6d5838d9-e5fa-4ea3-ac28-db47c7e40a74
from RUNNING to DESTROYING
I0309 01:03:22.479305   412 master.cpp:3295] Deactivating agent c9377c2c-5b6d-422f-9a65-7b6034ffdc3d-S0
at slave(398)@10.3.1.11:56224 (build-srv-03.zq4gs31qjdiunm1ryi1452nvnh.dx.internal.cloudapp.net)
I0309 01:03:22.479305 10768 hierarchical.cpp:766] Agent c9377c2c-5b6d-422f-9a65-7b6034ffdc3d-S0
deactivated
I0309 01:03:22.480304  4572 launcher.cpp:156] Asked to destroy container 6d5838d9-e5fa-4ea3-ac28-db47c7e40a74
I0309 01:03:22.585430   412 containerizer.cpp:2791] Container 6d5838d9-e5fa-4ea3-ac28-db47c7e40a74
has exited
I0309 01:03:22.619755  6212 master.cpp:1149] Master terminating
I0309 01:03:22.622753  2444 hierarchical.cpp:609] Removed agent c9377c2c-5b6d-422f-9a65-7b6034ffdc3d-S0
I0309 01:03:23.296753  7252 process.cpp:929] Stopped the socket accept loop
```

- Mesos Reviewbot Windows


On March 8, 2018, 10:07 p.m., Gaston Kleiman wrote:
> 
> -----------------------------------------------------------
> This is an automatically generated e-mail. To reply, visit:
> https://reviews.apache.org/r/65994/
> -----------------------------------------------------------
> 
> (Updated March 8, 2018, 10:07 p.m.)
> 
> 
> Review request for mesos and Greg Mann.
> 
> 
> Bugs: MESOS-8189
>     https://issues.apache.org/jira/browse/MESOS-8189
> 
> 
> Repository: mesos
> 
> 
> Description
> -------
> 
> Made the master forward operation status updates to the schedulers.
> 
> 
> Diffs
> -----
> 
>   src/master/master.cpp e666b664dd125317cda5d16285d444b9c21e1f35 
> 
> 
> Diff: https://reviews.apache.org/r/65994/diff/1/
> 
> 
> Testing
> -------
> 
> `sudo bin/mesos-tests.sh` on GNU/Linux
> 
> 
> Thanks,
> 
> Gaston Kleiman
> 
>


Mime
  • Unnamed multipart/alternative (inline, None, 0 bytes)
View raw message