mesos-reviews mailing list archives

Site index · List index
Message view « Date » · « Thread »
Top « Date » · « Thread »
From Mesos Reviewbot Windows <revi...@mesos.apache.org>
Subject Re: Review Request 65876: Enabled `--fetch_stall_timeout` in curl-based URI fetcher plugins.
Date Fri, 02 Mar 2018 21:18:38 GMT

-----------------------------------------------------------
This is an automatically generated e-mail. To reply, visit:
https://reviews.apache.org/r/65876/#review198553
-----------------------------------------------------------



FAIL: Some of the unit tests failed. Please check the relevant logs.

Reviews applied: `['65855', '65856', '65876']`

Failed command: `Start-MesosCITesting`

All the build artifacts available at: http://dcos-win.westus.cloudapp.azure.com/mesos-build/review/65876

Relevant logs:

- [mesos-tests-stdout.log](http://dcos-win.westus.cloudapp.azure.com/mesos-build/review/65876/logs/mesos-tests-stdout.log):

```
[       OK ] Endpoint/SlaveEndpointTest.NoAuthorizer/2 (125 ms)
[----------] 9 tests from Endpoint/SlaveEndpointTest (1156 ms total)

[----------] 2 tests from ContainerizerType/DefaultContainerDNSFlagTest
[ RUN      ] ContainerizerType/DefaultContainerDNSFlagTest.ValidateFlag/0
[       OK ] ContainerizerType/DefaultContainerDNSFlagTest.ValidateFlag/0 (38 ms)
[ RUN      ] ContainerizerType/DefaultContainerDNSFlagTest.ValidateFlag/1
[       OK ] ContainerizerType/DefaultContainerDNSFlagTest.ValidateFlag/1 (43 ms)
[----------] 2 tests from ContainerizerType/DefaultContainerDNSFlagTest (84 ms total)

[----------] 1 test from IsolationFlag/CpuIsolatorTest
[ RUN      ] IsolationFlag/CpuIsolatorTest.ROOT_UserCpuUsage/0
[       OK ] IsolationFlag/CpuIsolatorTest.ROOT_UserCpuUsage/0 (2573 ms)
[----------] 1 test from IsolationFlag/CpuIsolatorTest (2597 ms total)

[----------] 1 test from IsolationFlag/MemoryIsolatorTest
[ RUN      ] IsolationFlag/MemoryIsolatorTest.ROOT_MemUsage/0
[       OK ] IsolationFlag/MemoryIsolatorTest.ROOT_MemUsage/0 (2553 ms)
[----------] 1 test from IsolationFlag/MemoryIsolatorTest (2578 ms total)

[----------] Global test environment tear-down
[==========] 915 tests from 90 test cases ran. (475421 ms total)
[  PASSED  ] 914 tests.
[  FAILED  ] 1 test, listed below:
[  FAILED  ] CommandExecutorCheckTest.CommandCheckTimeout

 1 FAILED TEST
  YOU HAVE 211 DISABLED TESTS

```

- [mesos-tests-stderr.log](http://dcos-win.westus.cloudapp.azure.com/mesos-build/review/65876/logs/mesos-tests-stderr.log):

```
I0302 21:18:23.389863  3564 slave.cpp:3879] Shutting down framework 47158af6-6dc4-4c7f-8a05-18a82ad803b7-0000
I0302 21:18:23.389863  9100 master.cpp:10258] Updating the state of task 34598309-8d02-4509-8f4c-08b033f67359
of framework 47158af6-6dc4-4c7f-8a05-18a82ad803b7-0000 (latest state: TASK_KILLED, status
update state: TASK_KILLED)
I0302 21:18:23.389863  3564 slave.cpp:6586] Shutting down executor '34598309-8d02-4509-8f4c-08b033f67359'
of framework 47158af6-6dc4-4c7f-8a0I0302 21:18:22.671888  6428 exec.cpp:162] Version: 1.6.0
I0302 21:18:22.700888  1788 exec.cpp:236] Executor registered on agent 47158af6-6dc4-4c7f-8a05-18a82ad803b7-S0
I0302 21:18:22.704864  6668 executor.cpp:176] Received SUBSCRIBED event
I0302 21:18:22.709887  6668 executor.cpp:180] Subscribed executor on build-srv-03.zq4gs31qjdiunm1ryi1452nvnh.dx.internal.cloudapp.net
I0302 21:18:22.710891  6668 executor.cpp:176] Received LAUNCH event
I0302 21:18:22.715896  6668 executor.cpp:648] Starting task 34598309-8d02-4509-8f4c-08b033f67359
I0302 21:18:22.798888  6668 executor.cpp:483] Running 'D:\DCOS\mesos\src\mesos-containerizer.exe
launch <POSSIBLY-SENSITIVE-DATA>'
I0302 21:18:23.353863  6668 executor.cpp:661] Forked command at 5548
I0302 21:18:23.393864  2968 exec.cpp:445] Executor asked to shutdown
I0302 21:18:23.393864  6668 executor.cpp:176] Received SHUTDOWN event
I0302 21:18:23.394861  6668 executor.cpp:758] Shutting down
I0302 21:18:23.394861  6668 executor.cpp:868] Sending SIGTERM to process tree at pid 55-18a82ad803b7-0000
at executor(1)@10.3.1.11:59295
I0302 21:18:23.391863  3564 slave.cpp:922] Agent terminating
W0302 21:18:23.391863  3564 slave.cpp:3875] Ignoring shutdown framework 47158af6-6dc4-4c7f-8a05-18a82ad803b7-0000
because it is terminating
I0302 21:18:23.392863  9100 master.cpp:10357] Removing task 34598309-8d02-4509-8f4c-08b033f67359
with resources cpus(allocated: *):4; mem(allocated: *):2048; disk(allocated: *):1024; ports(allocated:
*):[31000-32000] of framework 47158af6-6dc4-4c7f-8a05-18a82ad803b7-0000 on agent 47158af6-6dc4-4c7f-8a05-18a82ad803b7-S0
at slave(398)@10.3.1.11:59273 (build-srv-03.zq4gs31qjdiunm1ryi1452nvnh.dx.internal.cloudapp.net)
I0302 21:18:23.394861  9100 master.cpp:1306] Agent 47158af6-6dc4-4c7f-8a05-18a82ad803b7-S0
at slave(398)@10.3.1.11:59273 (build-srv-03.zq4gs31qjdiunm1ryi1452nvnh.dx.internal.cloudapp.net)
disconnected
I0302 21:18:23.394861  7612 containerizer.cpp:2338] Destroying container c9d67aa7-324f-4ca7-b2a2-3c6250e09c75
in RUNNING state
I0302 21:18:23.394861  9100 master.cpp:3276] Disconnecting agent 47158af6-6dc4-4c7f-8a05-18a82ad803b7-S0
at slave(398)@10.3.1.11:59273 (build-srv-03.zq4gs31qjdiunm1ryi1452nvnh.dx.internal.cloudapp.net)
I0302 21:18:23.395864  7612 containerizer.cpp:2952] Transitioning the state of container c9d67aa7-324f-4ca7-b2a2-3c6250e09c75
from RUNNING to DESTROYING
I0302 21:18:23.395864  5844 hierarchical.cpp:344] Removed framework 47158af6-6dc4-4c7f-8a05-18a82ad803b7-0000
I0302 21:18:23.396867  9100 master.cpp:3295] Deactivating agent 47158af6-6dc4-4c7f-8a05-18a82ad803b7-S0
at slave(398)@10.3.1.11:59273 (build-srv-03.zq4gs31qjdiunm1ryi1452nvnh.dx.internal.cloudapp.net)
I0302 21:18:23.396867  7868 hierarchical.cpp:766] Agent 47158af6-6dc4-4c7f-8a05-18a82ad803b7-S0
deactivated
I0302 21:18:23.396867  7612 launcher.cpp:156] Asked to destroy container c9d67aa7-324f-4ca7-b2a2-3c6250e09c75
I0302 21:18:23.461082  7868 containerizer.cpp:2791] Container c9d67aa7-324f-4ca7-b2a2-3c6250e09c75
has exited
I0302 21:18:23.492103  7184 master.cpp:1149] Master terminating
I0302 21:18:23.496080  8968 hierarchical.cpp:609] Removed agent 47158af6-6dc4-4c7f-8a05-18a82ad803b7-S0
I0302 21:18:24.102655  5896 process.cpp:929] Stopped the socket accept loop
```

- Mesos Reviewbot Windows


On March 2, 2018, 11:20 a.m., Chun-Hung Hsiao wrote:
> 
> -----------------------------------------------------------
> This is an automatically generated e-mail. To reply, visit:
> https://reviews.apache.org/r/65876/
> -----------------------------------------------------------
> 
> (Updated March 2, 2018, 11:20 a.m.)
> 
> 
> Review request for mesos and Gilbert Song.
> 
> 
> Bugs: MESOS-8620
>     https://issues.apache.org/jira/browse/MESOS-8620
> 
> 
> Repository: mesos
> 
> 
> Description
> -------
> 
> This patch passes the `--fetch_stall_timeout` agent flag into
> `DockerFetcherPlugin` (through setting flag `docker_stall_timeout` in
> the Docker store) and `CurlFetcherPlugin` (through setting flag
> `curl_stall_timeout` in the Appc store).
> 
> 
> Diffs
> -----
> 
>   src/slave/containerizer/mesos/provisioner/appc/store.cpp c1f9661906eae019e43e1c3df7c28cccad3a6bb0

>   src/slave/containerizer/mesos/provisioner/docker/store.cpp c308bb04773fa81265d91a1247b3db3434b5746b

>   src/uri/fetchers/curl.hpp 909c2eb450630912c13831c3aa180fbccc8e9e4b 
>   src/uri/fetchers/curl.cpp 43584aaa424dc57f00880d5c89cdb73f23685800 
>   src/uri/fetchers/docker.hpp 6a89c0a69dd6f454cc22d025644900416e55ad50 
>   src/uri/fetchers/docker.cpp 21f8eb15903d505ba1cabe1f77a8f5d7043964d5 
> 
> 
> Diff: https://reviews.apache.org/r/65876/diff/2/
> 
> 
> Testing
> -------
> 
> sudo make check
> 
> 
> Thanks,
> 
> Chun-Hung Hsiao
> 
>


Mime
  • Unnamed multipart/alternative (inline, None, 0 bytes)
View raw message