mesos-reviews mailing list archives

Site index · List index
Message view « Date » · « Thread »
Top « Date » · « Thread »
From Mesos Reviewbot Windows <revi...@mesos.apache.org>
Subject Re: Review Request 65346: Updated Web UI to show quota guarantee and limit for roles.
Date Thu, 01 Mar 2018 23:51:28 GMT

-----------------------------------------------------------
This is an automatically generated e-mail. To reply, visit:
https://reviews.apache.org/r/65346/#review198487
-----------------------------------------------------------



FAIL: Some of the unit tests failed. Please check the relevant logs.

Reviews applied: `['65346']`

Failed command: `Start-MesosCITesting`

All the build artifacts available at: http://dcos-win.westus.cloudapp.azure.com/mesos-build/review/65346

Relevant logs:

- [mesos-tests-stdout.log](http://dcos-win.westus.cloudapp.azure.com/mesos-build/review/65346/logs/mesos-tests-stdout.log):

```
[       OK ] Endpoint/SlaveEndpointTest.NoAuthorizer/2 (131 ms)
[----------] 9 tests from Endpoint/SlaveEndpointTest (1287 ms total)

[----------] 2 tests from ContainerizerType/DefaultContainerDNSFlagTest
[ RUN      ] ContainerizerType/DefaultContainerDNSFlagTest.ValidateFlag/0
[       OK ] ContainerizerType/DefaultContainerDNSFlagTest.ValidateFlag/0 (51 ms)
[ RUN      ] ContainerizerType/DefaultContainerDNSFlagTest.ValidateFlag/1
[       OK ] ContainerizerType/DefaultContainerDNSFlagTest.ValidateFlag/1 (47 ms)
[----------] 2 tests from ContainerizerType/DefaultContainerDNSFlagTest (101 ms total)

[----------] 1 test from IsolationFlag/CpuIsolatorTest
[ RUN      ] IsolationFlag/CpuIsolatorTest.ROOT_UserCpuUsage/0
[       OK ] IsolationFlag/CpuIsolatorTest.ROOT_UserCpuUsage/0 (2445 ms)
[----------] 1 test from IsolationFlag/CpuIsolatorTest (2475 ms total)

[----------] 1 test from IsolationFlag/MemoryIsolatorTest
[ RUN      ] IsolationFlag/MemoryIsolatorTest.ROOT_MemUsage/0
[       OK ] IsolationFlag/MemoryIsolatorTest.ROOT_MemUsage/0 (2451 ms)
[----------] 1 test from IsolationFlag/MemoryIsolatorTest (2480 ms total)

[----------] Global test environment tear-down
[==========] 915 tests from 90 test cases ran. (493883 ms total)
[  PASSED  ] 914 tests.
[  FAILED  ] 1 test, listed below:
[  FAILED  ] CommandExecutorCheckTest.CommandCheckTimeout

 1 FAILED TEST
  YOU HAVE 211 DISABLED TESTS

```

- [mesos-tests-stderr.log](http://dcos-win.westus.cloudapp.azure.com/mesos-build/review/65346/logs/mesos-tests-stderr.log):

```
I0301 23:51:14.249897  8856 slave.cpp:922] Agent terminating
I0301 23:51:14.253895 10112 hierarchical.cpp:405] Deactivated framework f5fd0edc-a903-4f4d-9c8c-4e4a8736e1d4-0000
I0301 23:51:14.253895  8856 slave.cpp:3879] Shutting down framework f5fd0edc-a903-4f4d-9c8c-4e4a8736e1d4-0000
I0301 23:51:14.253895  9660 master.cpp:10258] Updating the state of task 2d18c18a-64ad-4ae3-801c-442ded53e4c1
of framework f5fd0edc-a903-4f4d-9c8c-4e4a8736e1d4-0000 (latest state: TASK_KILLED, status
update state: TASK_KILLED)
I0301 23:51:14.255899  9660 master.cpp:10357] Removing task 2d18c18a-64ad-4ae3-801c-442ded53e4c1
with resources cpus(allocated: *):4; mem(allocated: *):2048; disk(allocated: *):1024; ports(allocated:
*):[31000-32000] of framework f5fd0edc-a903-4f4d-9c8c-4e4a8736e1d4-0000 on agent f5fd0edc-a903-4f4d-9c8c-4e4a8736e1d4-S0
at slave(398)@10.3.1.5:51925 (build-srv-04.zq4gs31qjdiunm1ryi1452nvnh.dx.internal.cloudapp.net)
I0301 23:51:14.253895  88I0301 23:51:13.541932  9992 exec.cpp:162] Version: 1.6.0
I0301 23:51:13.570891 10808 exec.cpp:236] Executor registered on agent f5fd0edc-a903-4f4d-9c8c-4e4a8736e1d4-S0
I0301 23:51:13.574920  5376 executor.cpp:176] Received SUBSCRIBED event
I0301 23:51:13.579936  5376 executor.cpp:180] Subscribed executor on build-srv-04.zq4gs31qjdiunm1ryi1452nvnh.dx.internal.cloudapp.net
I0301 23:51:13.579936  5376 executor.cpp:176] Received LAUNCH event
I0301 23:51:13.584933  5376 executor.cpp:648] Starting task 2d18c18a-64ad-4ae3-801c-442ded53e4c1
I0301 23:51:13.665928  5376 executor.cpp:483] Running 'D:\DCOS\mesos\src\mesos-containerizer.exe
launch <POSSIBLY-SENSITIVE-DATA>'
I0301 23:51:14.213949  5376 executor.cpp:661] Forked command at 8744
I0301 23:51:14.259930  3636 exec.cpp:445] Executor asked to shutdown
I0301 23:51:14.260900  5376 executor.cpp:176] Received SHUTDOWN event
I0301 23:51:14.260900  5376 executor.cpp:758] Shutting down
I0301 23:51:14.260900  5376 executor.cpp:868] Sending SIGTERM to process tree at pid 856 slave.cpp:6586]
Shutting down executor '2d18c18a-64ad-4ae3-801c-442ded53e4c1' of framework f5fd0edc-a903-4f4d-9c8c-4e4a8736e1d4-0000
at executor(1)@10.3.1.5:51946
I0301 23:51:14.258903  8888 hierarchical.cpp:344] Removed framework f5fd0edc-a903-4f4d-9c8c-4e4a8736e1d4-0000
I0301 23:51:14.259930  9416 master.cpp:1306] Agent f5fd0edc-a903-4f4d-9c8c-4e4a8736e1d4-S0
at slave(398)@10.3.1.5:51925 (build-srv-04.zq4gs31qjdiunm1ryi1452nvnh.dx.internal.cloudapp.net)
disconnected
I0301 23:51:14.259930  9416 master.cpp:3276] Disconnecting agent f5fd0edc-a903-4f4d-9c8c-4e4a8736e1d4-S0
at slave(398)@10.3.1.5:51925 (build-srv-04.zq4gs31qjdiunm1ryi1452nvnh.dx.internal.cloudapp.net)
I0301 23:51:14.259930  9416 master.cpp:3295] Deactivating agent f5fd0edc-a903-4f4d-9c8c-4e4a8736e1d4-S0
at slave(398)@10.3.1.5:51925 (build-srv-04.zq4gs31qjdiunm1ryi1452nvnh.dx.internal.cloudapp.net)
I0301 23:51:14.259930  7948 hierarchical.cpp:766] Agent f5fd0edc-a903-4f4d-9c8c-4e4a8736e1d4-S0
deactivated
I0301 23:51:14.261904  7948 containerizer.cpp:2338] Destroying container 02edc328-4d80-4514-ba89-0809bc17aac8
in RUNNING state
I0301 23:51:14.263900  7948 containerizer.cpp:2952] Transitioning the state of container 02edc328-4d80-4514-ba89-0809bc17aac8
from RUNNING to DESTROYING
I0301 23:51:14.264897  7948 launcher.cpp:156] Asked to destroy container 02edc328-4d80-4514-ba89-0809bc17aac8
I0301 23:51:14.289896  5052 containerizer.cpp:2791] Container 02edc328-4d80-4514-ba89-0809bc17aac8
has exited
I0301 23:51:14.321919  8856 master.cpp:1149] Master terminating
I0301 23:51:14.323902  7512 hierarchical.cpp:609] Removed agent f5fd0edc-a903-4f4d-9c8c-4e4a8736e1d4-S0
I0301 23:51:14.964946  6272 process.cpp:929] Stopped the socket accept loop
```

- Mesos Reviewbot Windows


On March 1, 2018, 10:50 p.m., Armand Grillet wrote:
> 
> -----------------------------------------------------------
> This is an automatically generated e-mail. To reply, visit:
> https://reviews.apache.org/r/65346/
> -----------------------------------------------------------
> 
> (Updated March 1, 2018, 10:50 p.m.)
> 
> 
> Review request for mesos, Benjamin Mahler, Kapil Arya, Michael Park, Meng Zhu, and Till
Toenshoff.
> 
> 
> Bugs: MESOS-8486
>     https://issues.apache.org/jira/browse/MESOS-8486
> 
> 
> Repository: mesos
> 
> 
> Description
> -------
> 
> There is no limit field yet thus the limit displayed is currently
> the guarantee. We will access this field once it will be exposed.
> 
> 
> Diffs
> -----
> 
>   src/webui/master/static/css/mesos.css 3e3a3b13cfc4d63aea73d0a6572b22a2de94541e 
>   src/webui/master/static/index.html 46cb2843c2221ccebb7d811c0045be2c124afec1 
>   src/webui/master/static/js/app.js 8960f9d4421f7b96ba06deb623afafb06013b622 
>   src/webui/master/static/roles.html 1c84ad33a554e078d854e25b4d5ca311c8507f91 
> 
> 
> Diff: https://reviews.apache.org/r/65346/diff/5/
> 
> 
> Testing
> -------
> 
> New UI:
> ![New UI](https://i.imgur.com/8YFZnmH.png)
> The group columns cannot be ordered as they have sub-columns, this is expected.
> 
> 
> Thanks,
> 
> Armand Grillet
> 
>


Mime
  • Unnamed multipart/alternative (inline, None, 0 bytes)
View raw message