mesos-reviews mailing list archives

Site index · List index
Message view « Date » · « Thread »
Top « Date » · « Thread »
From Mesos Reviewbot Windows <revi...@mesos.apache.org>
Subject Re: Review Request 63862: Windows: Ported docker_tests.cpp.
Date Thu, 01 Mar 2018 20:24:23 GMT

-----------------------------------------------------------
This is an automatically generated e-mail. To reply, visit:
https://reviews.apache.org/r/63862/#review198468
-----------------------------------------------------------



FAIL: Some of the unit tests failed. Please check the relevant logs.

Reviews applied: `['65839', '65861', '65862', '65840', '63862']`

Failed command: `Start-MesosCITesting`

All the build artifacts available at: http://dcos-win.westus.cloudapp.azure.com/mesos-build/review/63862

Relevant logs:

- [mesos-tests-stdout.log](http://dcos-win.westus.cloudapp.azure.com/mesos-build/review/63862/logs/mesos-tests-stdout.log):

```
[       OK ] Endpoint/SlaveEndpointTest.NoAuthorizer/2 (144 ms)
[----------] 9 tests from Endpoint/SlaveEndpointTest (1246 ms total)

[----------] 2 tests from ContainerizerType/DefaultContainerDNSFlagTest
[ RUN      ] ContainerizerType/DefaultContainerDNSFlagTest.ValidateFlag/0
[       OK ] ContainerizerType/DefaultContainerDNSFlagTest.ValidateFlag/0 (40 ms)
[ RUN      ] ContainerizerType/DefaultContainerDNSFlagTest.ValidateFlag/1
[       OK ] ContainerizerType/DefaultContainerDNSFlagTest.ValidateFlag/1 (44 ms)
[----------] 2 tests from ContainerizerType/DefaultContainerDNSFlagTest (87 ms total)

[----------] 1 test from IsolationFlag/CpuIsolatorTest
[ RUN      ] IsolationFlag/CpuIsolatorTest.ROOT_UserCpuUsage/0
[       OK ] IsolationFlag/CpuIsolatorTest.ROOT_UserCpuUsage/0 (2586 ms)
[----------] 1 test from IsolationFlag/CpuIsolatorTest (2611 ms total)

[----------] 1 test from IsolationFlag/MemoryIsolatorTest
[ RUN      ] IsolationFlag/MemoryIsolatorTest.ROOT_MemUsage/0
[       OK ] IsolationFlag/MemoryIsolatorTest.ROOT_MemUsage/0 (2476 ms)
[----------] 1 test from IsolationFlag/MemoryIsolatorTest (2501 ms total)

[----------] Global test environment tear-down
[==========] 916 tests from 91 test cases ran. (471473 ms total)
[  PASSED  ] 915 tests.
[  FAILED  ] 1 test, listed below:
[  FAILED  ] CommandExecutorCheckTest.CommandCheckTimeout

 1 FAILED TEST
  YOU HAVE 210 DISABLED TESTS

```

- [mesos-tests-stderr.log](http://dcos-win.westus.cloudapp.azure.com/mesos-build/review/63862/logs/mesos-tests-stderr.log):

```
I0301 20:24:08.754911  1120 master.cpp:10258] Updating the state of task 3fe9fb67-1013-4cb8-963c-e2cba420dec4
of framework 5141e1be-97ce-44d2-84a8-8183a8110499-0000 (latest state: TASK_KILLED, status
update state: TASK_KILLED)
I0301 20:24:08.754911  7984 slave.cpp:3879] Shutting down framework 5141e1be-97ce-44d2-84a8-8183a8110499-0000
I0301 20:24:08.754911  7984 slave.cpp:6586] Shutting down executor '3fe9fb67-1013-4cb8-963c-e2cba420dec4'
of framework 5141e1be-97ce-44d2-84a8-8183a8110499-0000 at executor(1)@10.3.1.11:53096
I0301 20:24:08.756911  7984 slave.cpp:922] Agent teI0301 20:24:08.048912  7596 exec.cpp:162]
Version: 1.6.0
I0301 20:24:08.078908  3588 exec.cpp:236] Executor registered on agent 5141e1be-97ce-44d2-84a8-8183a8110499-S0
I0301 20:24:08.082911  9236 executor.cpp:176] Received SUBSCRIBED event
I0301 20:24:08.087911  9236 executor.cpp:180] Subscribed executor on build-srv-03.zq4gs31qjdiunm1ryi1452nvnh.dx.internal.cloudapp.net
I0301 20:24:08.088912  9236 executor.cpp:176] Received LAUNCH event
I0301 20:24:08.093912  9236 executor.cpp:648] Starting task 3fe9fb67-1013-4cb8-963c-e2cba420dec4
I0301 20:24:08.176914  9236 executor.cpp:483] Running 'D:\DCOS\mesos\src\mesos-containerizer.exe
launch <POSSIBLY-SENSITIVE-DATA>'
I0301 20:24:08.718909  9236 executor.cpp:661] Forked command at 8280
I0301 20:24:08.757910  6008 exec.cpp:445] Executor asked to shutdown
I0301 20:24:08.758909  9236 executor.cpp:176] Received SHUTDOWN event
I0301 20:24:08.758909  9236 executor.cpp:758] Shutting down
I0301 20:24:08.758909  9236 executor.cpp:868] Sending SIGTERM to process tree at pid 8rminating
W0301 20:24:08.757910  7984 slave.cpp:3875] Ignoring shutdown framework 5141e1be-97ce-44d2-84a8-8183a8110499-0000
because it is terminating
I0301 20:24:08.757910  1120 master.cpp:10357] Removing task 3fe9fb67-1013-4cb8-963c-e2cba420dec4
with resources cpus(allocated: *):4; mem(allocated: *):2048; disk(allocated: *):1024; ports(allocated:
*):[31000-32000] of framework 5141e1be-97ce-44d2-84a8-8183a8110499-0000 on agent 5141e1be-97ce-44d2-84a8-8183a8110499-S0
at slave(398)@10.3.1.11:53075 (build-srv-03.zq4gs31qjdiunm1ryi1452nvnh.dx.internal.cloudapp.net)
I0301 20:24:08.760911  1120 master.cpp:1306] Agent 5141e1be-97ce-44d2-84a8-8183a8110499-S0
at slave(398)@10.3.1.11:53075 (build-srv-03.zq4gs31qjdiunm1ryi1452nvnh.dx.internal.cloudapp.net)
disconnected
I0301 20:24:08.760911  1120 master.cpp:3276] Disconnecting agent 5141e1be-97ce-44d2-84a8-8183a8110499-S0
at slave(398)@10.3.1.11:53075 (build-srv-03.zq4gs31qjdiunm1ryi1452nvnh.dx.internal.cloudapp.net)
I0301 20:24:08.760911  1120 master.cpp:3295] Deactivating agent 5141e1be-97ce-44d2-84a8-8183a8110499-S0
at slave(398)@10.3.1.11:53075 (build-srv-03.zq4gs31qjdiunm1ryi1452nvnh.dx.internal.cloudapp.net)
I0301 20:24:08.761909  4568 containerizer.cpp:2338] Destroying container 2df2a9b1-5641-4637-873f-ec4e24eb568f
in RUNNING state
I0301 20:24:08.761909  4568 containerizer.cpp:2952] Transitioning the state of container 2df2a9b1-5641-4637-873f-ec4e24eb568f
from RUNNING to DESTROYING
I0301 20:24:08.761909  1740 hierarchical.cpp:344] Removed framework 5141e1be-97ce-44d2-84a8-8183a8110499-0000
I0301 20:24:08.761909  1740 hierarchical.cpp:766] Agent 5141e1be-97ce-44d2-84a8-8183a8110499-S0
deactivated
I0301 20:24:08.762908  4568 launcher.cpp:156] Asked to destroy container 2df2a9b1-5641-4637-873f-ec4e24eb568f
I0301 20:24:08.788137  1120 containerizer.cpp:2791] Container 2df2a9b1-5641-4637-873f-ec4e24eb568f
has exited
I0301 20:24:08.819914  8608 master.cpp:1149] Master terminating
I0301 20:24:08.822914  2552 hierarchical.cpp:609] Removed agent 5141e1be-97ce-44d2-84a8-8183a8110499-S0
I0301 20:24:09.530915  5380 process.cpp:929] Stopped the socket accept loop
```

- Mesos Reviewbot Windows


On Jan. 5, 2018, 10:33 a.m., Akash Gupta wrote:
> 
> -----------------------------------------------------------
> This is an automatically generated e-mail. To reply, visit:
> https://reviews.apache.org/r/63862/
> -----------------------------------------------------------
> 
> (Updated Jan. 5, 2018, 10:33 a.m.)
> 
> 
> Review request for mesos, Alexander Rukletsov, Andrew Schwartzmeyer, Gaston Kleiman,
Jie Yu, John Kordich, Joseph Wu, and Michael Park.
> 
> 
> Bugs: MESOS-7342
>     https://issues.apache.org/jira/browse/MESOS-7342
> 
> 
> Repository: mesos
> 
> 
> Description
> -------
> 
> Ported the disabled tests to run on Windows. The following tests
> could not be ported due to Windows platform limitations and remain
> diabled:
>   - ROOT_DOCKER_MountRelativeContainerPath (can't mount volumes inside
>     sandbox).
>   - ROOT_DOCKER_NVIDIA_GPU_DeviceAllow (no GPU container support).
>   - ROOT_DOCKER_NVIDIA_GPU_InspectDevices (no GPU container support).
> 
> 
> Diffs
> -----
> 
>   src/tests/containerizer/docker_common.hpp 3d69e54647d34ba0f33930d84db6c052e46ebc89

>   src/tests/containerizer/docker_tests.cpp 0ac4a79e03d5e11ead5a57a9749e26c20a1ddd57 
> 
> 
> Diff: https://reviews.apache.org/r/63862/diff/7/
> 
> 
> Testing
> -------
> 
> Windows mesos-test:
> [==========] 754 tests from 77 test cases ran. (270586 ms total)
> [  PASSED  ] 754 tests.
> 
> 
> Windows DockerTest only:
> [==========] 11 tests from 1 test case ran. (85617 ms total)
> [  PASSED  ] 11 tests.
> 
> Linux DockerTest (only 12 tests instead of 14, because I don't have Nvidia GPU):
> [==========] 12 tests from 1 test case ran. (12413 ms total)
> [  PASSED  ] 12 tests.
> 
> 
> Thanks,
> 
> Akash Gupta
> 
>


Mime
  • Unnamed multipart/alternative (inline, None, 0 bytes)
View raw message