mesos-reviews mailing list archives

Site index · List index
Message view « Date » · « Thread »
Top « Date » · « Thread »
From Mesos Reviewbot Windows <revi...@mesos.apache.org>
Subject Re: Review Request 65800: Added Anurag Bihani to the contributors list.
Date Sun, 25 Feb 2018 04:54:13 GMT

-----------------------------------------------------------
This is an automatically generated e-mail. To reply, visit:
https://reviews.apache.org/r/65800/#review198270
-----------------------------------------------------------



FAIL: Some of the unit tests failed. Please check the relevant logs.

Reviews applied: `['65797', '65798', '65799', '65800']`

Failed command: `Start-MesosCITesting`

All the build artifacts available at: http://dcos-win.westus.cloudapp.azure.com/mesos-build/review/65800

Relevant logs:

- [stout-tests-stdout.log](http://dcos-win.westus.cloudapp.azure.com/mesos-build/review/65800/logs/stout-tests-stdout.log):

```
[ RUN      ] RmdirTest.SYMLINK_RemoveDirectoryWithSymbolicLinkTargetFile
[       OK ] RmdirTest.SYMLINK_RemoveDirectoryWithSymbolicLinkTargetFile (4 ms)
[ RUN      ] RmdirTest.RemoveDirectoryButPreserveRoot
[       OK ] RmdirTest.RemoveDirectoryButPreserveRoot (5 ms)
[----------] 11 tests from RmdirTest (52 ms total)

[----------] 1 test from SocketTests
[ RUN      ] SocketTests.InitSocket
[       OK ] SocketTests.InitSocket (1 ms)
[----------] 1 test from SocketTests (2 ms total)

[----------] 2 tests from StrerrorTest
[ RUN      ] StrerrorTest.ValidErrno
[       OK ] StrerrorTest.ValidErrno (0 ms)
[ RUN      ] StrerrorTest.InvalidErrno
[       OK ] StrerrorTest.InvalidErrno (0 ms)
[----------] 2 tests from StrerrorTest (1 ms total)

[----------] Global test environment tear-down
[==========] 273 tests from 46 test cases ran. (4221 ms total)
[  PASSED  ] 270 tests.
[  FAILED  ] 3 tests, listed below:
[  FAILED  ] OsTest.SYMLINK_Realpath
[  FAILED  ] FsTest.CreateDirectoryAtMaxPath
[  FAILED  ] FsTest.CreateDirectoryLongerThanMaxPath

 3 FAILED TESTS
  YOU HAVE 7 DISABLED TESTS

```

- [stout-tests-stderr.log](http://dcos-win.westus.cloudapp.azure.com/mesos-build/review/65800/logs/stout-tests-stderr.log):

```
'invalid.command' is not recognized as an internal or external command,
operable program or batch file.
Subcommand 'subcommand' is not available
Usage: command <subcommand> [OPTIONS]

Available subcommands:
    help
    subcommand2

Multiple subcommands have name 'subcommand'
```

- [mesos-tests-stdout.log](http://dcos-win.westus.cloudapp.azure.com/mesos-build/review/65800/logs/mesos-tests-stdout.log):

```
[       OK ] Endpoint/SlaveEndpointTest.NoAuthorizer/2 (97 ms)
[----------] 9 tests from Endpoint/SlaveEndpointTest (901 ms total)

[----------] 2 tests from ContainerizerType/DefaultContainerDNSFlagTest
[ RUN      ] ContainerizerType/DefaultContainerDNSFlagTest.ValidateFlag/0
[       OK ] ContainerizerType/DefaultContainerDNSFlagTest.ValidateFlag/0 (32 ms)
[ RUN      ] ContainerizerType/DefaultContainerDNSFlagTest.ValidateFlag/1
[       OK ] ContainerizerType/DefaultContainerDNSFlagTest.ValidateFlag/1 (37 ms)
[----------] 2 tests from ContainerizerType/DefaultContainerDNSFlagTest (70 ms total)

[----------] 1 test from IsolationFlag/CpuIsolatorTest
[ RUN      ] IsolationFlag/CpuIsolatorTest.ROOT_UserCpuUsage/0
[       OK ] IsolationFlag/CpuIsolatorTest.ROOT_UserCpuUsage/0 (2198 ms)
[----------] 1 test from IsolationFlag/CpuIsolatorTest (2218 ms total)

[----------] 1 test from IsolationFlag/MemoryIsolatorTest
[ RUN      ] IsolationFlag/MemoryIsolatorTest.ROOT_MemUsage/0
[       OK ] IsolationFlag/MemoryIsolatorTest.ROOT_MemUsage/0 (2256 ms)
[----------] 1 test from IsolationFlag/MemoryIsolatorTest (2282 ms total)

[----------] Global test environment tear-down
[==========] 914 tests from 90 test cases ran. (414913 ms total)
[  PASSED  ] 913 tests.
[  FAILED  ] 1 test, listed below:
[  FAILED  ] FilesTest.DebugTest

 1 FAILED TEST
  YOU HAVE 211 DISABLED TESTS

```

- [mesos-tests-stderr.log](http://dcos-win.westus.cloudapp.azure.com/mesos-build/review/65800/logs/mesos-tests-stderr.log):

```
I0225 04:53:59.985405  1888 slave.cpp:3879] Shutting down framework dc30b1a6-ce1b-415c-95a0-fe6a7173e765-0000
I0225 04:53:59.985405  7668 hierarchical.cpp:405] Deactivated framework dc30b1a6-ce1b-415c-95a0-fe6a7173e765-0000
I0225 04:53:59.985405  1888 slave.cpp:6586] Shutting down executor '0cd56a80-731a-4827-8a27-c21c724d25f5'
of framework dc30b1a6-ce1b-415c-95a0-fe6a7173e765-0000 at executor(1)@1I0225 04:53:59.337406
 1164 exec.cpp:162] Version: 1.6.0
I0225 04:53:59.361402  1156 exec.cpp:236] Executor registered on agent dc30b1a6-ce1b-415c-95a0-fe6a7173e765-S0
I0225 04:53:59.366406  4380 executor.cpp:174] Received SUBSCRIBED event
I0225 04:53:59.370406  4380 executor.cpp:178] Subscribed executor on build-srv-04.zq4gs31qjdiunm1ryi1452nvnh.dx.internal.cloudapp.net
I0225 04:53:59.370406  4380 executor.cpp:174] Received LAUNCH event
I0225 04:53:59.374405  4380 executor.cpp:646] Starting task 0cd56a80-731a-4827-8a27-c21c724d25f5
I0225 04:53:59.450407  4380 executor.cpp:481] Running 'D:\DCOS\mesos\src\mesos-containerizer.exe
launch <POSSIBLY-SENSITIVE-DATA>'
I0225 04:53:59.958410  4380 executor.cpp:659] Forked command at 3176
I0225 04:53:59.987404  1156 exec.cpp:445] Executor asked to shutdown
I0225 04:53:59.988406  4380 executor.cpp:174] Received SHUTDOWN event
I0225 04:53:59.988406  4380 executor.cpp:756] Shutting down
I0225 04:53:59.988406  4380 executor.cpp:866] Sending SIGTERM to process tree at pid 30.3.1.5:58060
I0225 04:53:59.986408  1888 slave.cpp:922] Agent terminating
W0225 04:53:59.986408  1888 slave.cpp:3875] Ignoring shutdown framework dc30b1a6-ce1b-415c-95a0-fe6a7173e765-0000
because it is terminating
I0225 04:53:59.988406  8748 master.cpp:10357] Removing task 0cd56a80-731a-4827-8a27-c21c724d25f5
with resources cpus(allocated: *):4; mem(allocated: *):2048; disk(allocated: *):1024; ports(allocated:
*):[31000-32000] of framework dc30b1a6-ce1b-415c-95a0-fe6a7173e765-0000 on agent dc30b1a6-ce1b-415c-95a0-fe6a7173e765-S0
at slave(398)@10.3.1.5:58039 (build-srv-04.zq4gs31qjdiunm1ryi1452nvnh.dx.internal.cloudapp.net)
I0225 04:53:59.989405  2880 containerizer.cpp:2338] Destroying container d2ed673a-d334-4ab1-8b5b-4e7be29c89c7
in RUNNING state
I0225 04:53:59.990404  2880 containerizer.cpp:2952] Transitioning the state of container d2ed673a-d334-4ab1-8b5b-4e7be29c89c7
from RUNNING to DESTROYING
I0225 04:53:59.990404  8748 master.cpp:1306] Agent dc30b1a6-ce1b-415c-95a0-fe6a7173e765-S0
at slave(398)@10.3.1.5:58039 (build-srv-04.zq4gs31qjdiunm1ryi1452nvnh.dx.internal.cloudapp.net)
disconnected
I0225 04:53:59.990404  5308 hierarchical.cpp:344] Removed framework dc30b1a6-ce1b-415c-95a0-fe6a7173e765-0000
I0225 04:53:59.990404  2880 launcher.cpp:156] Asked to destroy container d2ed673a-d334-4ab1-8b5b-4e7be29c89c7
I0225 04:53:59.990404  8748 master.cpp:3276] Disconnecting agent dc30b1a6-ce1b-415c-95a0-fe6a7173e765-S0
at slave(398)@10.3.1.5:58039 (build-srv-04.zq4gs31qjdiunm1ryi1452nvnh.dx.internal.cloudapp.net)
I0225 04:53:59.990404  8748 master.cpp:3295] Deactivating agent dc30b1a6-ce1b-415c-95a0-fe6a7173e765-S0
at slave(398)@10.3.1.5:58039 (build-srv-04.zq4gs31qjdiunm1ryi1452nvnh.dx.internal.cloudapp.net)
I0225 04:53:59.991888  7668 hierarchical.cpp:766] Agent dc30b1a6-ce1b-415c-95a0-fe6a7173e765-S0
deactivated
I0225 04:54:00.087330  1888 containerizer.cpp:2791] Container d2ed673a-d334-4ab1-8b5b-4e7be29c89c7
has exited
I0225 04:54:00.115325  2260 master.cpp:1149] Master terminating
I0225 04:54:00.118321  1888 hierarchical.cpp:609] Removed agent dc30b1a6-ce1b-415c-95a0-fe6a7173e765-S0
I0225 04:54:00.498340  8272 process.cpp:929] Stopped the socket accept loop
```

- Mesos Reviewbot Windows


On Feb. 24, 2018, 7:13 p.m., Sachin Paryani wrote:
> 
> -----------------------------------------------------------
> This is an automatically generated e-mail. To reply, visit:
> https://reviews.apache.org/r/65800/
> -----------------------------------------------------------
> 
> (Updated Feb. 24, 2018, 7:13 p.m.)
> 
> 
> Review request for mesos and Andrew Schwartzmeyer.
> 
> 
> Repository: mesos
> 
> 
> Description
> -------
> 
> See summary.
> 
> 
> Diffs
> -----
> 
>   docs/contributors.yaml 73f4d08a84f46966abac6a0e384aaa0c6cd3c5ad 
> 
> 
> Diff: https://reviews.apache.org/r/65800/diff/1/
> 
> 
> Testing
> -------
> 
> 
> Thanks,
> 
> Sachin Paryani
> 
>


Mime
  • Unnamed multipart/alternative (inline, None, 0 bytes)
View raw message