mesos-reviews mailing list archives

Site index · List index
Message view « Date » · « Thread »
Top « Date » · « Thread »
From Mesos Reviewbot Windows <revi...@mesos.apache.org>
Subject Re: Review Request 65797: Added Sachin Paryani to contributors list.
Date Sun, 25 Feb 2018 04:07:17 GMT

-----------------------------------------------------------
This is an automatically generated e-mail. To reply, visit:
https://reviews.apache.org/r/65797/#review198268
-----------------------------------------------------------



FAIL: Some of the unit tests failed. Please check the relevant logs.

Reviews applied: `['65797']`

Failed command: `Start-MesosCITesting`

All the build artifacts available at: http://dcos-win.westus.cloudapp.azure.com/mesos-build/review/65797

Relevant logs:

- [stout-tests-stdout.log](http://dcos-win.westus.cloudapp.azure.com/mesos-build/review/65797/logs/stout-tests-stdout.log):

```
[ RUN      ] RmdirTest.SYMLINK_RemoveDirectoryWithSymbolicLinkTargetFile
[       OK ] RmdirTest.SYMLINK_RemoveDirectoryWithSymbolicLinkTargetFile (4 ms)
[ RUN      ] RmdirTest.RemoveDirectoryButPreserveRoot
[       OK ] RmdirTest.RemoveDirectoryButPreserveRoot (5 ms)
[----------] 11 tests from RmdirTest (53 ms total)

[----------] 1 test from SocketTests
[ RUN      ] SocketTests.InitSocket
[       OK ] SocketTests.InitSocket (1 ms)
[----------] 1 test from SocketTests (2 ms total)

[----------] 2 tests from StrerrorTest
[ RUN      ] StrerrorTest.ValidErrno
[       OK ] StrerrorTest.ValidErrno (0 ms)
[ RUN      ] StrerrorTest.InvalidErrno
[       OK ] StrerrorTest.InvalidErrno (0 ms)
[----------] 2 tests from StrerrorTest (2 ms total)

[----------] Global test environment tear-down
[==========] 273 tests from 46 test cases ran. (4170 ms total)
[  PASSED  ] 270 tests.
[  FAILED  ] 3 tests, listed below:
[  FAILED  ] OsTest.SYMLINK_Realpath
[  FAILED  ] FsTest.CreateDirectoryAtMaxPath
[  FAILED  ] FsTest.CreateDirectoryLongerThanMaxPath

 3 FAILED TESTS
  YOU HAVE 7 DISABLED TESTS

```

- [stout-tests-stderr.log](http://dcos-win.westus.cloudapp.azure.com/mesos-build/review/65797/logs/stout-tests-stderr.log):

```
'invalid.command' is not recognized as an internal or external command,
operable program or batch file.
Subcommand 'subcommand' is not available
Usage: command <subcommand> [OPTIONS]

Available subcommands:
    help
    subcommand2

Multiple subcommands have name 'subcommand'
```

- [mesos-tests-stdout.log](http://dcos-win.westus.cloudapp.azure.com/mesos-build/review/65797/logs/mesos-tests-stdout.log):

```
[       OK ] Endpoint/SlaveEndpointTest.NoAuthorizer/2 (97 ms)
[----------] 9 tests from Endpoint/SlaveEndpointTest (929 ms total)

[----------] 2 tests from ContainerizerType/DefaultContainerDNSFlagTest
[ RUN      ] ContainerizerType/DefaultContainerDNSFlagTest.ValidateFlag/0
[       OK ] ContainerizerType/DefaultContainerDNSFlagTest.ValidateFlag/0 (32 ms)
[ RUN      ] ContainerizerType/DefaultContainerDNSFlagTest.ValidateFlag/1
[       OK ] ContainerizerType/DefaultContainerDNSFlagTest.ValidateFlag/1 (36 ms)
[----------] 2 tests from ContainerizerType/DefaultContainerDNSFlagTest (69 ms total)

[----------] 1 test from IsolationFlag/CpuIsolatorTest
[ RUN      ] IsolationFlag/CpuIsolatorTest.ROOT_UserCpuUsage/0
[       OK ] IsolationFlag/CpuIsolatorTest.ROOT_UserCpuUsage/0 (2263 ms)
[----------] 1 test from IsolationFlag/CpuIsolatorTest (2285 ms total)

[----------] 1 test from IsolationFlag/MemoryIsolatorTest
[ RUN      ] IsolationFlag/MemoryIsolatorTest.ROOT_MemUsage/0
[       OK ] IsolationFlag/MemoryIsolatorTest.ROOT_MemUsage/0 (2247 ms)
[----------] 1 test from IsolationFlag/MemoryIsolatorTest (2269 ms total)

[----------] Global test environment tear-down
[==========] 914 tests from 90 test cases ran. (410200 ms total)
[  PASSED  ] 913 tests.
[  FAILED  ] 1 test, listed below:
[  FAILED  ] FilesTest.DebugTest

 1 FAILED TEST
  YOU HAVE 211 DISABLED TESTS

```

- [mesos-tests-stderr.log](http://dcos-win.westus.cloudapp.azure.com/mesos-build/review/65797/logs/mesos-tests-stderr.log):

```
I0225 04:07:02.471891  8140 executor.cpp:174] Received SUBSCRIBED event
I0225 04:07:02.475914  8140 executor.cpp:178] Subscribed executor on build-srv-04.zq4gs31qjdiunm1ryi1452nvnh.dx.internal.cloudapp.net
I0225 04:07:02.475914  8140 executor.cpp:174] Received LAUNCH event
I0225 04:07:02.480914  8140 executor.cpp:646] Starting task 19126e0d-1e93-4408-932e-44b7ebbcd3b5
I0225 04:07:02.553913  8140 executor.cpp:481] Running 'D:\DCOS\mesos\src\mesos-containerizer.exe
launch <POSSIBLY-SENSITIVE-DATA>'
I0225 04:07:03.064975  8140 executor.cpp:659] Forked command at 7468
I0225 04:07:03.092895   524 exec.cpp:445] Executor asked to shutdown
I0225 04:07:03.093895  8140 executor.cpp:174] Received SHUTDOWN event
I0225 04:07:03.094897  8140 executor.cpp:756] Shutting down
I0225 04:07:03.094897  8140 executor.cpp:866] Sending SIGTERM to process tree at pid 74:07:03.089900
 5108 master.cpp:3239] Deactivating framework d4887f66-c758-46b3-9440-d22d1479565d-0000 (default)
at scheduler-58ee79ed-c822-49d8-b510-7bc44d226ce9@10.3.1.5:55812
I0225 04:07:03.090896  7644 hierarchical.cpp:405] Deactivated framework d4887f66-c758-46b3-9440-d22d1479565d-0000
I0225 04:07:03.091894  8244 slave.cpp:3879] Shutting down framework d4887f66-c758-46b3-9440-d22d1479565d-0000
I0225 04:07:03.091894  5108 master.cpp:10258] Updating the state of task 19126e0d-1e93-4408-932e-44b7ebbcd3b5
of framework d4887f66-c758-46b3-9440-d22d1479565d-0000 (latest state: TASK_KILLED, status
update state: TASK_KILLED)
I0225 04:07:03.091894  8244 slave.cpp:6586] Shutting down executor '19126e0d-1e93-4408-932e-44b7ebbcd3b5'
of framework d4887f66-c758-46b3-9440-d22d1479565d-0000 at executor(1)@10.3.1.5:55833
I0225 04:07:03.092895  8244 slave.cpp:922] Agent terminating
W0225 04:07:03.092895  8244 slave.cpp:3875] Ignoring shutdown framework d4887f66-c758-46b3-9440-d22d1479565d-0000
because it is terminating
I0225 04:07:03.094897  5108 master.cpp:10357] Removing task 19126e0d-1e93-4408-932e-44b7ebbcd3b5
with resources cpus(allocated: *):4; mem(allocated: *):2048; disk(allocated: *):1024; ports(allocated:
*):[31000-32000] of framework d4887f66-c758-46b3-9440-d22d1479565d-0000 on agent d4887f66-c758-46b3-9440-d22d1479565d-S0
at slave(398)@10.3.1.5:55812 (build-srv-04.zq4gs31qjdiunm1ryi1452nvnh.dx.internal.cloudapp.net)
I0225 04:07:03.095896  8244 containerizer.cpp:2338] Destroying container 5f9f0b8d-eb51-4792-b414-12028448b2e5
in RUNNING state
I0225 04:07:03.095896  8244 containerizer.cpp:2952] Transitioning the state of container 5f9f0b8d-eb51-4792-b414-12028448b2e5
from RUNNING to DESTROYING
I0225 04:07:03.096896  8244 launcher.cpp:156] Asked to destroy container 5f9f0b8d-eb51-4792-b414-12028448b2e5
I0225 04:07:03.096896  5108 master.cpp:1306] Agent d4887f66-c758-46b3-9440-d22d1479565d-S0
at slave(398)@10.3.1.5:55812 (build-srv-04.zq4gs31qjdiunm1ryi1452nvnh.dx.internal.cloudapp.net)
disconnected
I0225 04:07:03.097895  5108 master.cpp:3276] Disconnecting agent d4887f66-c758-46b3-9440-d22d1479565d-S0
at slave(398)@10.3.1.5:55812 (build-srv-04.zq4gs31qjdiunm1ryi1452nvnh.dx.internal.cloudapp.net)
I0225 04:07:03.097895  7644 hierarchical.cpp:344] Removed framework d4887f66-c758-46b3-9440-d22d1479565d-0000
I0225 04:07:03.097895  5108 master.cpp:3295] Deactivating agent d4887f66-c758-46b3-9440-d22d1479565d-S0
at slave(398)@10.3.1.5:55812 (build-srv-04.zq4gs31qjdiunm1ryi1452nvnh.dx.internal.cloudapp.net)
I0225 04:07:03.098896  5144 hierarchical.cpp:766] Agent d4887f66-c758-46b3-9440-d22d1479565d-S0
deactivated
I0225 04:07:03.174614  7644 containerizer.cpp:2791] Container 5f9f0b8d-eb51-4792-b414-12028448b2e5
has exited
I0225 04:07:03.201614  6368 master.cpp:1149] Master terminating
I0225 04:07:03.203613  3324 hierarchical.cpp:609] Removed agent d4887f66-c758-46b3-9440-d22d1479565d-S0
I0225 04:07:03.641724  7044 process.cpp:929] Stopped the socket accept loop
```

- Mesos Reviewbot Windows


On Feb. 25, 2018, 3:13 a.m., Sachin Paryani wrote:
> 
> -----------------------------------------------------------
> This is an automatically generated e-mail. To reply, visit:
> https://reviews.apache.org/r/65797/
> -----------------------------------------------------------
> 
> (Updated Feb. 25, 2018, 3:13 a.m.)
> 
> 
> Review request for mesos and Andrew Schwartzmeyer.
> 
> 
> Repository: mesos
> 
> 
> Description
> -------
> 
> Added Sachin Paryani to contributors list.
> 
> 
> Diffs
> -----
> 
>   docs/contributors.yaml 73f4d08a84f46966abac6a0e384aaa0c6cd3c5ad 
> 
> 
> Diff: https://reviews.apache.org/r/65797/diff/1/
> 
> 
> Testing
> -------
> 
> 
> Thanks,
> 
> Sachin Paryani
> 
>


Mime
  • Unnamed multipart/alternative (inline, None, 0 bytes)
View raw message