mesos-reviews mailing list archives

Site index · List index
Message view « Date » · « Thread »
Top « Date » · « Thread »
From Mesos Reviewbot Windows <revi...@mesos.apache.org>
Subject Re: Review Request 65674: Introduced helper for creating Mesos UUIDs.
Date Sat, 24 Feb 2018 11:52:34 GMT

-----------------------------------------------------------
This is an automatically generated e-mail. To reply, visit:
https://reviews.apache.org/r/65674/#review198253
-----------------------------------------------------------



FAIL: Some of the unit tests failed. Please check the relevant logs.

Reviews applied: `['65587', '65588', '65589', '65590', '65591', '65673', '65674']`

Failed command: `Start-MesosCITesting`

All the build artifacts available at: http://dcos-win.westus.cloudapp.azure.com/mesos-build/review/65674

Relevant logs:

- [stout-tests-stdout.log](http://dcos-win.westus.cloudapp.azure.com/mesos-build/review/65674/logs/stout-tests-stdout.log):

```
[ RUN      ] RmdirTest.SYMLINK_RemoveDirectoryWithSymbolicLinkTargetFile
[       OK ] RmdirTest.SYMLINK_RemoveDirectoryWithSymbolicLinkTargetFile (5 ms)
[ RUN      ] RmdirTest.RemoveDirectoryButPreserveRoot
[       OK ] RmdirTest.RemoveDirectoryButPreserveRoot (7 ms)
[----------] 11 tests from RmdirTest (63 ms total)

[----------] 1 test from SocketTests
[ RUN      ] SocketTests.InitSocket
[       OK ] SocketTests.InitSocket (2 ms)
[----------] 1 test from SocketTests (2 ms total)

[----------] 2 tests from StrerrorTest
[ RUN      ] StrerrorTest.ValidErrno
[       OK ] StrerrorTest.ValidErrno (1 ms)
[ RUN      ] StrerrorTest.InvalidErrno
[       OK ] StrerrorTest.InvalidErrno (0 ms)
[----------] 2 tests from StrerrorTest (2 ms total)

[----------] Global test environment tear-down
[==========] 273 tests from 46 test cases ran. (5313 ms total)
[  PASSED  ] 270 tests.
[  FAILED  ] 3 tests, listed below:
[  FAILED  ] OsTest.SYMLINK_Realpath
[  FAILED  ] FsTest.CreateDirectoryAtMaxPath
[  FAILED  ] FsTest.CreateDirectoryLongerThanMaxPath

 3 FAILED TESTS
  YOU HAVE 7 DISABLED TESTS

```

- [stout-tests-stderr.log](http://dcos-win.westus.cloudapp.azure.com/mesos-build/review/65674/logs/stout-tests-stderr.log):

```
'invalid.command' is not recognized as an internal or external command,
operable program or batch file.
Subcommand 'subcommand' is not available
Usage: command <subcommand> [OPTIONS]

Available subcommands:
    help
    subcommand2

Multiple subcommands have name 'subcommand'
```

- [mesos-tests-stdout.log](http://dcos-win.westus.cloudapp.azure.com/mesos-build/review/65674/logs/mesos-tests-stdout.log):

```
[       OK ] Endpoint/SlaveEndpointTest.NoAuthorizer/2 (125 ms)
[----------] 9 tests from Endpoint/SlaveEndpointTest (1220 ms total)

[----------] 2 tests from ContainerizerType/DefaultContainerDNSFlagTest
[ RUN      ] ContainerizerType/DefaultContainerDNSFlagTest.ValidateFlag/0
[       OK ] ContainerizerType/DefaultContainerDNSFlagTest.ValidateFlag/0 (37 ms)
[ RUN      ] ContainerizerType/DefaultContainerDNSFlagTest.ValidateFlag/1
[       OK ] ContainerizerType/DefaultContainerDNSFlagTest.ValidateFlag/1 (43 ms)
[----------] 2 tests from ContainerizerType/DefaultContainerDNSFlagTest (83 ms total)

[----------] 1 test from IsolationFlag/CpuIsolatorTest
[ RUN      ] IsolationFlag/CpuIsolatorTest.ROOT_UserCpuUsage/0
[       OK ] IsolationFlag/CpuIsolatorTest.ROOT_UserCpuUsage/0 (2407 ms)
[----------] 1 test from IsolationFlag/CpuIsolatorTest (2431 ms total)

[----------] 1 test from IsolationFlag/MemoryIsolatorTest
[ RUN      ] IsolationFlag/MemoryIsolatorTest.ROOT_MemUsage/0
[       OK ] IsolationFlag/MemoryIsolatorTest.ROOT_MemUsage/0 (2601 ms)
[----------] 1 test from IsolationFlag/MemoryIsolatorTest (2626 ms total)

[----------] Global test environment tear-down
[==========] 914 tests from 90 test cases ran. (466657 ms total)
[  PASSED  ] 913 tests.
[  FAILED  ] 1 test, listed below:
[  FAILED  ] FilesTest.DebugTest

 1 FAILED TEST
  YOU HAVE 211 DISABLED TESTS

```

- [mesos-tests-stderr.log](http://dcos-win.westus.cloudapp.azure.com/mesos-build/review/65674/logs/mesos-tests-stderr.log):

```
I0224 11:52:18.096415  8992 slave.cpp:3876] Shutting down framework 91b15ae2-7689-4f99-8efc-205e18ed6cb1-0000
I0224 11:52:18.096415  8320 master.cpp:10168] Updating the state of task 9f6627de-11ea-4026-b319-7820a28354a9
of framework 91b15ae2-7689-4f99-8efc-205e18ed6cb1-0000 (latest state: TASK_KILLED, status
update state: TASK_KILLED)
I0224 11:52:18.097440  8992 slave.cpp:6569] Shutting down executor '9f6627de-11ea-4026-b319-7820a28354a9'
of framework 91b15ae2-7689-4f99-8efc-205e18ed6cb1-0000 at executor(1)@10.3.1.11:61952
I0224 11:52:18.098415  8992 slave.cpp:922] Agent terminating
W0224 11:52:18.098415  8992 slave.cpp:3872] Ignoring shutdown framework 91b15ae2-7689-4f99-8efc-205e18ed6cb1-0000
because it is terminating
I0224 11:52:18.100414  8320 master.cpp:10267] Removing task 9f6627de-11ea-4026-b319-7820a28354a9
with resources cpus(allocated: *):4; mem(allocated: *):2048; disk(allocated: *):1024; ports(allocated:
*):[31000-32000] of framework 91b15ae2-7689-4f99-8efc-205e18ed6cb1-0000 on agent 91b15ae2-7689-4f9I0224
11:52:17.346493  8824 exec.cpp:162] Version: 1.6.0
I0224 11:52:17.384498  2668 exec.cpp:236] Executor registered on agent 91b15ae2-7689-4f99-8efc-205e18ed6cb1-S0
I0224 11:52:17.389498  1604 executor.cpp:174] Received SUBSCRIBED event
I0224 11:52:17.395467  1604 executor.cpp:178] Subscribed executor on build-srv-03.zq4gs31qjdiunm1ryi1452nvnh.dx.internal.cloudapp.net
I0224 11:52:17.395467  1604 executor.cpp:174] Received LAUNCH event
I0224 11:52:17.401466  1604 executor.cpp:646] Starting task 9f6627de-11ea-4026-b319-7820a28354a9
I0224 11:52:17.489459  1604 executor.cpp:481] Running 'D:\DCOS\mesos\src\mesos-containerizer.exe
launch <POSSIBLY-SENSITIVE-DATA>'
I0224 11:52:18.053416  1604 executor.cpp:659] Forked command at 9344
I0224 11:52:18.100414  1020 exec.cpp:445] Executor asked to shutdown
I0224 11:52:18.101414  1604 executor.cpp:174] Received SHUTDOWN event
I0224 11:52:18.101414  1604 executor.cpp:756] Shutting down
I0224 11:52:18.101414  1604 executor.cpp:866] Sending SIGTERM to process tree at pid 99-8efc-205e18ed6cb1-S0
at slave(398)@10.3.1.11:61931 (build-srv-03.zq4gs31qjdiunm1ryi1452nvnh.dx.internal.cloudapp.net)
I0224 11:52:18.102413  9988 containerizer.cpp:2338] Destroying container bdf0cd17-e5ee-4b70-8a23-6a44846689bb
in RUNNING state
I0224 11:52:18.102413  9988 containerizer.cpp:2952] Transitioning the state of container bdf0cd17-e5ee-4b70-8a23-6a44846689bb
from RUNNING to DESTROYING
I0224 11:52:18.104413  9988 launcher.cpp:156] Asked to destroy container bdf0cd17-e5ee-4b70-8a23-6a44846689bb
I0224 11:52:18.104413  8320 master.cpp:1306] Agent 91b15ae2-7689-4f99-8efc-205e18ed6cb1-S0
at slave(398)@10.3.1.11:61931 (build-srv-03.zq4gs31qjdiunm1ryi1452nvnh.dx.internal.cloudapp.net)
disconnected
I0224 11:52:18.104413  8320 master.cpp:3276] Disconnecting agent 91b15ae2-7689-4f99-8efc-205e18ed6cb1-S0
at slave(398)@10.3.1.11:61931 (build-srv-03.zq4gs31qjdiunm1ryi1452nvnh.dx.internal.cloudapp.net)
I0224 11:52:18.104413  8320 master.cpp:3295] Deactivating agent 91b15ae2-7689-4f99-8efc-205e18ed6cb1-S0
at slave(398)@10.3.1.11:61931 (build-srv-03.zq4gs31qjdiunm1ryi1452nvnh.dx.internal.cloudapp.net)
I0224 11:52:18.104413  3800 hierarchical.cpp:344] Removed framework 91b15ae2-7689-4f99-8efc-205e18ed6cb1-0000
I0224 11:52:18.106411  8992 hierarchical.cpp:766] Agent 91b15ae2-7689-4f99-8efc-205e18ed6cb1-S0
deactivated
I0224 11:52:18.150436  6420 containerizer.cpp:2791] Container bdf0cd17-e5ee-4b70-8a23-6a44846689bb
has exited
I0224 11:52:18.184409  9912 master.cpp:1149] Master terminating
I0224 11:52:18.187438  7960 hierarchical.cpp:609] Removed agent 91b15ae2-7689-4f99-8efc-205e18ed6cb1-S0
I0224 11:52:19.045366  5152 process.cpp:929] Stopped the socket accept loop
```

- Mesos Reviewbot Windows


On Feb. 15, 2018, 2:54 p.m., Benjamin Bannier wrote:
> 
> -----------------------------------------------------------
> This is an automatically generated e-mail. To reply, visit:
> https://reviews.apache.org/r/65674/
> -----------------------------------------------------------
> 
> (Updated Feb. 15, 2018, 2:54 p.m.)
> 
> 
> Review request for mesos and Jan Schlicht.
> 
> 
> Repository: mesos
> 
> 
> Description
> -------
> 
> Introduced helper for creating Mesos UUIDs.
> 
> 
> Diffs
> -----
> 
>   src/common/protobuf_utils.hpp 9a940db188436b9c5a39b0637cb4c15ee2ab5266 
>   src/common/protobuf_utils.cpp f516091e9208552488c154f34adde6f20d3413bf 
>   src/resource_provider/manager.cpp cc195a3d35b93dd6493951de1ff8a1cb8a886377 
>   src/resource_provider/storage/provider.cpp 33abc0e05a804969ae14da9cb9c58698ba1aaea5

>   src/slave/slave.cpp e2facb3c15a2f907f6497c58a36842ed707f2c70 
>   src/tests/operation_status_update_manager_tests.cpp c4429f40e1d7226be59d8ba4283bd91e16799d5a

>   src/tests/resource_provider_manager_tests.cpp c8997ec41fe0c3e02b0f6ab205c9009205c992da

>   src/tests/resource_provider_validation_tests.cpp 9f34c459e24396815f4a785815f83923e276874f

>   src/tests/slave_tests.cpp e253317a67019302f18afe11e2a314e716cec226 
> 
> 
> Diff: https://reviews.apache.org/r/65674/diff/2/
> 
> 
> Testing
> -------
> 
> `make check`
> 
> 
> Thanks,
> 
> Benjamin Bannier
> 
>


Mime
  • Unnamed multipart/alternative (inline, None, 0 bytes)
View raw message