mesos-reviews mailing list archives

Site index · List index
Message view « Date » · « Thread »
Top « Date » · « Thread »
From Mesos Reviewbot Windows <revi...@mesos.apache.org>
Subject Re: Review Request 65324: WIP: Updated web UI URL generation to conditionally make it work with adminrouter.
Date Wed, 24 Jan 2018 22:38:11 GMT

-----------------------------------------------------------
This is an automatically generated e-mail. To reply, visit:
https://reviews.apache.org/r/65324/#review196176
-----------------------------------------------------------



FAIL: Mesos tests failed to build.

Reviews applied: `['65320', '65323', '65324']`

Failed command: `cmake.exe --build . --target mesos-tests --config Debug`

All the build artifacts available at: http://dcos-win.westus.cloudapp.azure.com/mesos-build/review/65324

Relevant logs:

- [mesos-tests-build-cmake-stdout.log](http://dcos-win.westus.cloudapp.azure.com/mesos-build/review/65324/logs/mesos-tests-build-cmake-stdout.log):

```
  D:\DCOS\mesos\mesos\src\slave\containerizer\mesos\containerizer.cpp(572): error C2780: 'process::Future<T>
process::dispatch(const process::Process<T> *,R (__cdecl T::* )(void))': expects 2 arguments
- 3 provided [D:\DCOS\mesos\src\mesos.vcxproj]
  D:\DCOS\mesos\mesos\src\slave\containerizer\mesos\containerizer.cpp(572): error C2780: 'process::Future<T>
process::dispatch(const process::Process<T> &,R (__cdecl T::* )(void))': expects
2 arguments - 3 provided [D:\DCOS\mesos\src\mesos.vcxproj]
  D:\DCOS\mesos\mesos\src\slave\containerizer\mesos\containerizer.cpp(572): error C2780: 'process::Future<T>
process::dispatch(const process::PID<T> &,R (__cdecl T::* )(void))': expects 2 arguments
- 3 provided [D:\DCOS\mesos\src\mesos.vcxproj]
  D:\DCOS\mesos\mesos\src\slave\containerizer\mesos\containerizer.cpp(572): error C2780: 'process::Future<T>
process::dispatch(const process::Process<T> *,process::Future<T> (__cdecl T::*
)(P0,P1,P2,P3,P4,P5,P6,P7,P8,P9,P10,P11),A0 &&,A1 &&,A2 &&,A3 &&,A4
&&,A5 &&,A6 &&,A7 &&,A8 &&,A9 &&,A10 &&,A11
&&)': expects 14 arguments - 3 provided [D:\DCOS\mesos\src\mesos.vcxproj]
  D:\DCOS\mesos\mesos\src\slave\containerizer\mesos\containerizer.cpp(572): error C2780: 'process::Future<T>
process::dispatch(const process::Process<T> &,process::Future<T> (__cdecl
T::* )(P0,P1,P2,P3,P4,P5,P6,P7,P8,P9,P10,P11),A0 &&,A1 &&,A2 &&,A3
&&,A4 &&,A5 &&,A6 &&,A7 &&,A8 &&,A9 &&,A10
&&,A11 &&)': expects 14 arguments - 3 provided [D:\DCOS\mesos\src\mesos.vcxproj]
  D:\DCOS\mesos\mesos\src\slave\containerizer\mesos\containerizer.cpp(572): error C2780: 'process::Future<T>
process::dispatch(const process::PID<T> &,process::Future<T> (__cdecl T::*
)(P0,P1,P2,P3,P4,P5,P6,P7,P8,P9,P10,P11),A0 &&,A1 &&,A2 &&,A3 &&,A4
&&,A5 &&,A6 &&,A7 &&,A8 &&,A9 &&,A10 &&,A11
&&)': expects 14 arguments - 3 provided [D:\DCOS\mesos\src\mesos.vcxproj]
  D:\DCOS\mesos\mesos\src\slave\containerizer\mesos\containerizer.cpp(572): error C2780: 'process::Future<T>
process::dispatch(const process::Process<T> *,process::Future<T> (__cdecl T::*
)(P0,P1,P2,P3,P4,P5,P6,P7,P8,P9,P10),A0 &&,A1 &&,A2 &&,A3 &&,A4
&&,A5 &&,A6 &&,A7 &&,A8 &&,A9 &&,A10 &&)':
expects 13 arguments - 3 provided [D:\DCOS\mesos\src\mesos.vcxproj]
  D:\DCOS\mesos\mesos\src\slave\containerizer\mesos\containerizer.cpp(572): error C2780: 'process::Future<T>
process::dispatch(const process::Process<T> &,process::Future<T> (__cdecl
T::* )(P0,P1,P2,P3,P4,P5,P6,P7,P8,P9,P10),A0 &&,A1 &&,A2 &&,A3 &&,A4
&&,A5 &&,A6 &&,A7 &&,A8 &&,A9 &&,A10 &&)':
expects 13 arguments - 3 provided [D:\DCOS\mesos\src\mesos.vcxproj]
  D:\DCOS\mesos\mesos\src\slave\containerizer\mesos\containerizer.cpp(572): error C2780: 'process::Future<T>
process::dispatch(const process::PID<T> &,process::Future<T> (__cdecl T::*
)(P0,P1,P2,P3,P4,P5,P6,P7,P8,P9,P10),A0 &&,A1 &&,A2 &&,A3 &&,A4
&&,A5 &&,A6 &&,A7 &&,A8 &&,A9 &&,A10 &&)':
expects 13 arguments - 3 provided [D:\DCOS\mesos\src\mesos.vcxproj]
  D:\DCOS\mesos\mesos\src\slave\containerizer\mesos\containerizer.cpp(572): error C2780: 'process::Future<T>
process::dispatch(const process::Process<T> *,process::Future<T> (__cdecl T::*
)(P0,P1,P2,P3,P4,P5,P6,P7,P8,P9),A0 &&,A1 &&,A2 &&,A3 &&,A4
&&,A5 &&,A6 &&,A7 &&,A8 &&,A9 &&)': expects
12 arguments - 3 provided [D:\DCOS\mesos\src\mesos.vcxproj]
  D:\DCOS\mesos\mesos\src\slave\containerizer\mesos\containerizer.cpp(572): error C2780: 'process::Future<T>
process::dispatch(const process::Process<T> &,process::Future<T> (__cdecl
T::* )(P0,P1,P2,P3,P4,P5,P6,P7,P8,P9),A0 &&,A1 &&,A2 &&,A3 &&,A4
&&,A5 &&,A6 &&,A7 &&,A8 &&,A9 &&)': expects
12 arguments - 3 provided [D:\DCOS\mesos\src\mesos.vcxproj]
  D:\DCOS\mesos\mesos\src\slave\containerizer\mesos\containerizer.cpp(572): error C2780: 'process::Future<T>
process::dispatch(const process::PID<T> &,process::Future<T> (__cdecl T::*
)(P0,P1,P2,P3,P4,P5,P6,P7,P8,P9),A0 &&,A1 &&,A2 &&,A3 &&,A4
&&,A5 &&,A6 &&,A7 &&,A8 &&,A9 &&)': expects
12 arguments - 3 provided [D:\DCOS\mesos\src\mesos.vcxproj]
  D:\DCOS\mesos\mesos\src\slave\containerizer\mesos\containerizer.cpp(572): error C2780: 'process::Future<T>
process::dispatch(const process::Process<T> *,process::Future<T> (__cdecl T::*
)(P0,P1,P2,P3,P4,P5,P6,P7,P8),A0 &&,A1 &&,A2 &&,A3 &&,A4 &&,A5
&&,A6 &&,A7 &&,A8 &&)': expects 11 arguments - 3 provided
[D:\DCOS\mesos\src\mesos.vcxproj]
  D:\DCOS\mesos\mesos\src\slave\containerizer\mesos\containerizer.cpp(572): error C2780: 'process::Future<T>
process::dispatch(const process::Process<T> &,process::Future<T> (__cdecl
T::* )(P0,P1,P2,P3,P4,P5,P6,P7,P8),A0 &&,A1 &&,A2 &&,A3 &&,A4
&&,A5 &&,A6 &&,A7 &&,A8 &&)': expects 11 arguments
- 3 provided [D:\DCOS\mesos\src\mesos.vcxproj]
  D:\DCOS\mesos\mesos\src\slave\containerizer\mesos\containerizer.cpp(572): error C2780: 'process::Future<T>
process::dispatch(const process::PID<T> &,process::Future<T> (__cdecl T::*
)(P0,P1,P2,P3,P4,P5,P6,P7,P8),A0 &&,A1 &&,A2 &&,A3 &&,A4 &&,A5
&&,A6 &&,A7 &&,A8 &&)': expects 11 arguments - 3 provided
[D:\DCOS\mesos\src\mesos.vcxproj]
  D:\DCOS\mesos\mesos\src\slave\containerizer\mesos\containerizer.cpp(572): error C2780: 'process::Future<T>
process::dispatch(const process::Process<T> *,process::Future<T> (__cdecl T::*
)(P0,P1,P2,P3,P4,P5,P6,P7),A0 &&,A1 &&,A2 &&,A3 &&,A4 &&,A5
&&,A6 &&,A7 &&)': expects 10 arguments - 3 provided [D:\DCOS\mesos\src\mesos.vcxproj]
  D:\DCOS\mesos\mesos\src\slave\containerizer\mesos\containerizer.cpp(572): error C2780: 'process::Future<T>
process::dispatch(const process::Process<T> &,process::Future<T> (__cdecl
T::* )(P0,P1,P2,P3,P4,P5,P6,P7),A0 &&,A1 &&,A2 &&,A3 &&,A4
&&,A5 &&,A6 &&,A7 &&)': expects 10 arguments - 3 provided
[D:\DCOS\mesos\src\mesos.vcxproj]
  D:\DCOS\mesos\mesos\src\slave\containerizer\mesos\containerizer.cpp(572): error C2780: 'process::Future<T>
process::dispatch(const process::PID<T> &,process::Future<T> (__cdecl T::*
)(P0,P1,P2,P3,P4,P5,P6,P7),A0 &&,A1 &&,A2 &&,A3 &&,A4 &&,A5
&&,A6 &&,A7 &&)': expects 10 arguments - 3 provided [D:\DCOS\mesos\src\mesos.vcxproj]
  D:\DCOS\mesos\mesos\src\slave\containerizer\mesos\containerizer.cpp(572): error C2780: 'process::Future<T>
process::dispatch(const process::Process<T> *,process::Future<T> (__cdecl T::*
)(P0,P1,P2,P3,P4,P5,P6),A0 &&,A1 &&,A2 &&,A3 &&,A4 &&,A5
&&,A6 &&)': expects 9 arguments - 3 provided [D:\DCOS\mesos\src\mesos.vcxproj]
  D:\DCOS\mesos\mesos\src\slave\containerizer\mesos\containerizer.cpp(572): error C2780: 'process::Future<T>
process::dispatch(const process::Process<T> &,process::Future<T> (__cdecl
T::* )(P0,P1,P2,P3,P4,P5,P6),A0 &&,A1 &&,A2 &&,A3 &&,A4 &&,A5
&&,A6 &&)': expects 9 arguments - 3 provided [D:\DCOS\mesos\src\mesos.vcxproj]
  D:\DCOS\mesos\mesos\src\slave\containerizer\mesos\containerizer.cpp(572): error C2780: 'process::Future<T>
process::dispatch(const process::PID<T> &,process::Future<T> (__cdecl T::*
)(P0,P1,P2,P3,P4,P5,P6),A0 &&,A1 &&,A2 &&,A3 &&,A4 &&,A5
&&,A6 &&)': expects 9 arguments - 3 provided [D:\DCOS\mesos\src\mesos.vcxproj]
  D:\DCOS\mesos\mesos\src\slave\containerizer\mesos\containerizer.cpp(572): error C2780: 'process::Future<T>
process::dispatch(const process::Process<T> *,process::Future<T> (__cdecl T::*
)(P0,P1,P2,P3,P4,P5),A0 &&,A1 &&,A2 &&,A3 &&,A4 &&,A5
&&)': expects 8 arguments - 3 provided [D:\DCOS\mesos\src\mesos.vcxproj]
  D:\DCOS\mesos\mesos\src\slave\containerizer\mesos\containerizer.cpp(572): error C2780: 'process::Future<T>
process::dispatch(const process::Process<T> &,process::Future<T> (__cdecl
T::* )(P0,P1,P2,P3,P4,P5),A0 &&,A1 &&,A2 &&,A3 &&,A4 &&,A5
&&)': expects 8 arguments - 3 provided [D:\DCOS\mesos\src\mesos.vcxproj]
  D:\DCOS\mesos\mesos\src\slave\containerizer\mesos\containerizer.cpp(572): fatal error C1003:
error count exceeds 100; stopping compilation [D:\DCOS\mesos\src\mesos.vcxproj]

    114 Warning(s)
    105 Error(s)

Time Elapsed 00:05:25.88
```

- [mesos-tests-CMakeOutput.log](http://dcos-win.westus.cloudapp.azure.com/mesos-build/review/65324/logs/mesos-tests-CMakeOutput.log):

```
  Creating directory "cmTC_291b7.dir\Debug\".

  Creating directory "D:\DCOS\mesos\CMakeFiles\CMakeTmp\Debug\".

  Creating directory "cmTC_291b7.dir\Debug\cmTC_291b7.tlog\".

InitializeBuildStatus:

  Creating "cmTC_291b7.dir\Debug\cmTC_291b7.tlog\unsuccessfulbuild" because "AlwaysCreate"
was specified.

ClCompile:

  C:\Program Files (x86)\Microsoft Visual Studio\2017\Community\VC\Tools\MSVC\14.12.25827\bin\HostX64\x64\CL.exe
/c /Zi /W3 /WX- /diagnostics:classic /Od /Ob0 /D WIN32 /D _WINDOWS /D COMPILER_SUPPORTS_CXX11
/D "CMAKE_INTDIR=\"Debug\"" /D _MBCS /Gm- /EHsc /RTC1 /MDd /GS /fp:precise /Zc:wchar_t /Zc:forScope
/Zc:inline /GR /Fo"cmTC_291b7.dir\Debug\" /Fd"cmTC_291b7.dir\Debug\vc141.pdb" /Gd /TP /errorReport:queue
D:\DCOS\mesos\CMakeFiles\CMakeTmp\src.cxx

  Microsoft (R) C/C++ Optimizing Compiler Version 19.12.25830.2 for x64

  Copyright (C) Microsoft Corporation.  All rights reserved.

  

  cl /c /Zi /W3 /WX- /diagnostics:classic /Od /Ob0 /D WIN32 /D _WINDOWS /D COMPILER_SUPPORTS_CXX11
/D "CMAKE_INTDIR=\"Debug\"" /D _MBCS /Gm- /EHsc /RTC1 /MDd /GS /fp:precise /Zc:wchar_t /Zc:forScope
/Zc:inline /GR /Fo"cmTC_291b7.dir\Debug\" /Fd"cmTC_291b7.dir\Debug\vc141.pdb" /Gd /TP /errorReport:queue
D:\DCOS\mesos\CMakeFiles\CMakeTmp\src.cxx

  src.cxx

  

Link:

  C:\Program Files (x86)\Microsoft Visual Studio\2017\Community\VC\Tools\MSVC\14.12.25827\bin\HostX64\x64\link.exe
/ERRORREPORT:QUEUE /OUT:"D:\DCOS\mesos\CMakeFiles\CMakeTmp\Debug\cmTC_291b7.exe" /INCREMENTAL
/NOLOGO kernel32.lib user32.lib gdi32.lib winspool.lib shell32.lib ole32.lib oleaut32.lib
uuid.lib comdlg32.lib advapi32.lib /MANIFEST /MANIFESTUAC:"level='asInvoker' uiAccess='false'"
/manifest:embed /DEBUG /PDB:"D:/DCOS/mesos/CMakeFiles/CMakeTmp/Debug/cmTC_291b7.pdb" /SUBSYSTEM:CONSOLE
/TLBID:1 /DYNAMICBASE /NXCOMPAT /IMPLIB:"D:/DCOS/mesos/CMakeFiles/CMakeTmp/Debug/cmTC_291b7.lib"
/MACHINE:X64  /machine:x64 cmTC_291b7.dir\Debug\src.obj

  cmTC_291b7.vcxproj -> D:\DCOS\mesos\CMakeFiles\CMakeTmp\Debug\cmTC_291b7.exe

FinalizeBuildStatus:

  Deleting file "cmTC_291b7.dir\Debug\cmTC_291b7.tlog\unsuccessfulbuild".

  Touching "cmTC_291b7.dir\Debug\cmTC_291b7.tlog\cmTC_291b7.lastbuildstate".

Done Building Project "D:\DCOS\mesos\CMakeFiles\CMakeTmp\cmTC_291b7.vcxproj" (default targets).



Build succeeded.

    0 Warning(s)

    0 Error(s)



Time Elapsed 00:00:01.00


Source file was:
int main() { return 0; }
```

- [mesos-tests-CMakeError.log](http://dcos-win.westus.cloudapp.azure.com/mesos-build/review/65324/logs/mesos-tests-CMakeError.log):

```
PrepareForBuild:

  Creating directory "cmTC_13fac.dir\Debug\".

  Creating directory "D:\DCOS\mesos\CMakeFiles\CMakeTmp\Debug\".

  Creating directory "cmTC_13fac.dir\Debug\cmTC_13fac.tlog\".

InitializeBuildStatus:

  Creating "cmTC_13fac.dir\Debug\cmTC_13fac.tlog\unsuccessfulbuild" because "AlwaysCreate"
was specified.

ClCompile:

  C:\Program Files (x86)\Microsoft Visual Studio\2017\Community\VC\Tools\MSVC\14.12.25827\bin\HostX64\x64\CL.exe
/c /Zi /W3 /WX- /diagnostics:classic /MP /Od /Ob0 /D WIN32 /D _WINDOWS /D UNICODE /D _UNICODE
/D "CMAKE_INTDIR=\"Debug\"" /D _UNICODE /D UNICODE /Gm- /RTC1 /MTd /GS /fp:precise /Zc:wchar_t
/Zc:forScope /Zc:inline /Fo"cmTC_13fac.dir\Debug\" /Fd"cmTC_13fac.dir\Debug\vc141.pdb" /Gd
/TC /errorReport:queue D:\DCOS\mesos\CMakeFiles\CMakeTmp\CheckIncludeFile.c

  Microsoft (R) C/C++ Optimizing Compiler Version 19.12.25830.2 for x64

  Copyright (C) Microsoft Corporation.  All rights reserved.

  

  cl /c /Zi /W3 /WX- /diagnostics:classic /MP /Od /Ob0 /D WIN32 /D _WINDOWS /D UNICODE /D
_UNICODE /D "CMAKE_INTDIR=\"Debug\"" /D _UNICODE /D UNICODE /Gm- /RTC1 /MTd /GS /fp:precise
/Zc:wchar_t /Zc:forScope /Zc:inline /Fo"cmTC_13fac.dir\Debug\" /Fd"cmTC_13fac.dir\Debug\vc141.pdb"
/Gd /TC /errorReport:queue D:\DCOS\mesos\CMakeFiles\CMakeTmp\CheckIncludeFile.c

  CheckIncludeFile.c

  

D:\DCOS\mesos\CMakeFiles\CMakeTmp\CheckIncludeFile.c(1): fatal error C1083: Cannot open include
file: 'pthread.h': No such file or directory [D:\DCOS\mesos\CMakeFiles\CMakeTmp\cmTC_13fac.vcxproj]

Done Building Project "D:\DCOS\mesos\CMakeFiles\CMakeTmp\cmTC_13fac.vcxproj" (default targets)
-- FAILED.



Build FAILED.



"D:\DCOS\mesos\CMakeFiles\CMakeTmp\cmTC_13fac.vcxproj" (default target) (1) ->

(ClCompile target) -> 

  D:\DCOS\mesos\CMakeFiles\CMakeTmp\CheckIncludeFile.c(1): fatal error C1083: Cannot open
include file: 'pthread.h': No such file or directory [D:\DCOS\mesos\CMakeFiles\CMakeTmp\cmTC_13fac.vcxproj]



    0 Warning(s)

    1 Error(s)



Time Elapsed 00:00:00.58



```

- Mesos Reviewbot Windows


On Jan. 24, 2018, 10:40 p.m., Till Toenshoff wrote:
> 
> -----------------------------------------------------------
> This is an automatically generated e-mail. To reply, visit:
> https://reviews.apache.org/r/65324/
> -----------------------------------------------------------
> 
> (Updated Jan. 24, 2018, 10:40 p.m.)
> 
> 
> Review request for mesos, Gaston Kleiman, Greg Mann, and Kapil Arya.
> 
> 
> Repository: mesos
> 
> 
> Description
> -------
> 
> see summary.
> 
> 
> Diffs
> -----
> 
>   configure.ac b48c80db4d01bf975168398865a12b700bd3d33c 
>   src/webui/master/static/js/controllers.js 59665869dbea77c00740e42f2590473181dfe2fe

> 
> 
> Diff: https://reviews.apache.org/r/65324/diff/1/
> 
> 
> Testing
> -------
> 
> 
> Thanks,
> 
> Till Toenshoff
> 
>


Mime
  • Unnamed multipart/alternative (inline, None, 0 bytes)
View raw message