mesos-reviews mailing list archives

Site index · List index
Message view « Date » · « Thread »
Top « Date » · « Thread »
From Mesos Reviewbot Windows <revi...@mesos.apache.org>
Subject Re: Review Request 65146: Windows: Enabled internet tests.
Date Sat, 13 Jan 2018 07:31:36 GMT

-----------------------------------------------------------
This is an automatically generated e-mail. To reply, visit:
https://reviews.apache.org/r/65146/#review195390
-----------------------------------------------------------



FAIL: Some Mesos tests failed.

Reviews applied: `['65144', '65145', '65146']`

Failed command: `D:\DCOS\mesos\src\mesos-tests.exe --verbose`

All the build artifacts available at: http://dcos-win.westus.cloudapp.azure.com/mesos-build/review/65146

Relevant logs:

- [mesos-tests-stdout.log](http://dcos-win.westus.cloudapp.azure.com/mesos-build/review/65146/logs/mesos-tests-stdout.log):

```
[ RUN      ] ContainerizerType/DefaultContainerDNSFlagTest.ValidateFlag/1
[       OK ] ContainerizerType/DefaultContainerDNSFlagTest.ValidateFlag/1 (38 ms)
[----------] 2 tests from ContainerizerType/DefaultContainerDNSFlagTest (72 ms total)

[----------] 1 test from IsolationFlag/CpuIsolatorTest
[ RUN      ] IsolationFlag/CpuIsolatorTest.ROOT_UserCpuUsage/0
[       OK ] IsolationFlag/CpuIsolatorTest.ROOT_UserCpuUsage/0 (2349 ms)
[----------] 1 test from IsolationFlag/CpuIsolatorTest (2374 ms total)

[----------] 1 test from IsolationFlag/MemoryIsolatorTest
[ RUN      ] IsolationFlag/MemoryIsolatorTest.ROOT_MemUsage/0
[       OK ] IsolationFlag/MemoryIsolatorTest.ROOT_MemUsage/0 (2449 ms)
[----------] 1 test from IsolationFlag/MemoryIsolatorTest (2474 ms total)

[----------] Global test environment tear-down
[==========] 856 tests from 86 test cases ran. (313684 ms total)
[  PASSED  ] 849 tests.
[  FAILED  ] 7 tests, listed below:
[  FAILED  ] HealthCheckTest.ROOT_INTERNET_CURL_HealthyTaskViaHTTPWithContainerImage
[  FAILED  ] HealthCheckTest.ROOT_INTERNET_CURL_HealthyTaskViaHTTPSWithContainerImage
[  FAILED  ] HealthCheckTest.ROOT_INTERNET_CURL_HealthyTaskViaTCPWithContainerImage
[  FAILED  ] DockerFetcherPluginTest.INTERNET_CURL_FetchManifest
[  FAILED  ] DockerFetcherPluginTest.INTERNET_CURL_FetchBlob
[  FAILED  ] DockerFetcherPluginTest.INTERNET_CURL_FetchImage
[  FAILED  ] DockerFetcherPluginTest.INTERNET_CURL_InvokeFetchByName

 7 FAILED TESTS
  YOU HAVE 214 DISABLED TESTS

```

- [mesos-tests-stderr.log](http://dcos-win.westus.cloudapp.azure.com/mesos-build/review/65146/logs/mesos-tests-stderr.log):

```
I0113 07:31:15.445353 10872 master.cpp:10161] Updating the state of task c71d6266-2180-42b3-a146-d555eadb593e
of framework 5bc91b29-d0e2-4f30-b31e-1ce1f239d52c-0000 (latest state: TASK_KILLED, status
update state: TASK_KILLED)
I0113 07:31:15.44I0113 07:31:14.777302  8796 exec.cpp:162] Version: 1.6.0
I0113 07:31:14.802307  9684 exec.cpp:236] Executor registered on agent 5bc91b29-d0e2-4f30-b31e-1ce1f239d52c-S0
I0113 07:31:14.805305    96 executor.cpp:171] Received SUBSCRIBED event
I0113 07:31:14.809309    96 executor.cpp:175] Subscribed executor on build-srv-03.zq4gs31qjdiunm1ryi1452nvnh.dx.internal.cloudapp.net
I0113 07:31:14.810308    96 executor.cpp:171] Received LAUNCH event
I0113 07:31:14.813308    96 executor.cpp:638] Starting task c71d6266-2180-42b3-a146-d555eadb593e
I0113 07:31:14.891315    96 executor.cpp:478] Running 'D:\DCOS\mesos\src\mesos-containerizer.exe
launch <POSSIBLY-SENSITIVE-DATA>'
I0113 07:31:15.420347    96 executor.cpp:651] Forked command at 14972
I0113 07:31:15.447351 11288 exec.cpp:445] Executor asked to shutdown
I0113 07:31:15.449350    96 executor.cpp:171] Received SHUTDOWN event
I0113 07:31:15.449350    96 executor.cpp:748] Shutting down
I0113 07:31:15.449350    96 executor.cpp:863] Sending SIGTERM to process tree at pid 5353
15208 slave.cpp:3388] Shutting down framework 5bc91b29-d0e2-4f30-b31e-1ce1f239d52c-0000
I0113 07:31:15.446352 15208 slave.cpp:6066] Shutting down executor 'c71d6266-2180-42b3-a146-d555eadb593e'
of framework 5bc91b29-d0e2-4f30-b31e-1ce1f239d52c-0000 at executor(1)@10.3.1.11:55644
I0113 07:31:15.447351 15208 slave.cpp:931] Agent terminating
W0113 07:31:15.447351 15208 slave.cpp:3384] Ignoring shutdown framework 5bc91b29-d0e2-4f30-b31e-1ce1f239d52c-0000
because it is terminating
I0113 07:31:15.448351 10872 master.cpp:10265] Removing task c71d6266-2180-42b3-a146-d555eadb593e
with resources cpus(allocated: *):4; mem(allocated: *):2048; disk(allocated: *):1024; ports(allocated:
*):[31000-32000] of framework 5bc91b29-d0e2-4f30-b31e-1ce1f239d52c-0000 on agent 5bc91b29-d0e2-4f30-b31e-1ce1f239d52c-S0
at slave(329)@10.3.1.11:55623 (build-srv-03.zq4gs31qjdiunm1ryi1452nvnh.dx.internal.cloudapp.net)
I0113 07:31:15.451349 10872 master.cpp:1306] Agent 5bc91b29-d0e2-4f30-b31e-1ce1f239d52c-S0
at slave(329)@10.3.1.11:55623 (build-srv-03.zq4gs31qjdiunm1ryi1452nvnh.dx.internal.cloudapp.net)
disconnected
I0113 07:31:15.451349  1532 containerizer.cpp:2352] Destroying container c1cba775-ed81-4651-9253-7f220b32eb2f
in RUNNING state
I0113 07:31:15.451349 12296 hierarchical.cpp:344] Removed framework 5bc91b29-d0e2-4f30-b31e-1ce1f239d52c-0000
I0113 07:31:15.451349 10872 master.cpp:3287] Disconnecting agent 5bc91b29-d0e2-4f30-b31e-1ce1f239d52c-S0
at slave(329)@10.3.1.11:55623 (build-srv-03.zq4gs31qjdiunm1ryi1452nvnh.dx.internal.cloudapp.net)
I0113 07:31:15.451349  1532 containerizer.cpp:2966] Transitioning the state of container c1cba775-ed81-4651-9253-7f220b32eb2f
from RUNNING to DESTROYING
I0113 07:31:15.451349 10872 master.cpp:3306] Deactivating agent 5bc91b29-d0e2-4f30-b31e-1ce1f239d52c-S0
at slave(329)@10.3.1.11:55623 (build-srv-03.zq4gs31qjdiunm1ryi1452nvnh.dx.internal.cloudapp.net)
I0113 07:31:15.452353 10360 hierarchical.cpp:766] Agent 5bc91b29-d0e2-4f30-b31e-1ce1f239d52c-S0
deactivated
I0113 07:31:15.452353  1532 launcher.cpp:156] Asked to destroy container c1cba775-ed81-4651-9253-7f220b32eb2f
I0113 07:31:15.561453 10872 containerizer.cpp:2805] Container c1cba775-ed81-4651-9253-7f220b32eb2f
has exited
I0113 07:31:15.591470 13816 master.cpp:1148] Master terminating
I0113 07:31:15.593466 12532 hierarchical.cpp:609] Removed agent 5bc91b29-d0e2-4f30-b31e-1ce1f239d52c-S0
I0113 07:31:15.991495  9344 process.cpp:888] Failed to accept socket: future discarded
```

- Mesos Reviewbot Windows


On Jan. 13, 2018, 1:33 a.m., Andrew Schwartzmeyer wrote:
> 
> -----------------------------------------------------------
> This is an automatically generated e-mail. To reply, visit:
> https://reviews.apache.org/r/65146/
> -----------------------------------------------------------
> 
> (Updated Jan. 13, 2018, 1:33 a.m.)
> 
> 
> Review request for mesos, Akash Gupta, Jie Yu, and Joseph Wu.
> 
> 
> Bugs: MESOS-8225
>     https://issues.apache.org/jira/browse/MESOS-8225
> 
> 
> Repository: mesos
> 
> 
> Description
> -------
> 
> The `ping` command's interface is different on Windows, but the
> operation is the same: one ping, with a one second timeout.
> 
> 
> Diffs
> -----
> 
>   src/tests/environment.cpp 72bd621f02f97ea5fd553f3dc0bd52adb8ddee8f 
> 
> 
> Diff: https://reviews.apache.org/r/65146/diff/1/
> 
> 
> Testing
> -------
> 
> This does not have to be cherry picked for `1.5.x`, and it just enables otherwise disabled
tests.
> 
> 
> Thanks,
> 
> Andrew Schwartzmeyer
> 
>


Mime
  • Unnamed multipart/alternative (inline, None, 0 bytes)
View raw message